{"text_format":"1","workbook":"xlsx","n_sheets":3,"sheets":["SPIRADRIVE CONFIGURATOR","Sheet2","Sheet3"],"not_rendered":{"charts":0,"images":8,"macros":1,"external_links":0,"defined_names":2,"comments":0,"pivot_tables":0},"unopened":[],"bounds":{"document_bytes":16777216,"sheet_cells":100000,"rows_first":2000,"rows_last":500,"rows_between":2000,"halvings":0,"cell_chars":16384,"cell_head_chars":4096},"cells_cut":0,"cells_raw":0,"read":"whole","date_system":"1904"}

{"sheet":"SPIRADRIVE CONFIGURATOR","index":0,"n_rows":34,"n_cols":13,"rows_kept":34,"cut":false,"hidden":false,"merged":[[0,3,0,5],[8,3,8,5],[6,0,7,5],[29,7,29,12],[30,7,30,12],[18,7,28,12],[16,7,16,12],[17,7,17,12],[5,7,5,12],[5,6,6,6],[13,7,13,12],[14,7,14,12],[15,7,15,12]]}
["SPIRADRIVE",null,"®","Gearbox Configurator"]
["Click the drop down arrows in the shaded cells below. Work from left to right."]
["Centre Distance - mm","Ratio",null,"Input Shaft Configuration","Output Shaft Configuration","Lubrication","Backlash"]
[]
["Centre Distance must be selected before choosing ratios"]
[null,null,null,null,null,null,"Performance Data","Input Speed - RPM"]
[{"$f":"IF(G4=\"3 minutes of arc - Bronze Gear\",\"Bronze Gears are Rated at 60% of Steel Gear Performance\",IF(G4=\"Zero Backlash\",\"Ultra Low and Zero Backlash Only Available to Special Order. Contact Davall Sales Department\",\" \"))","v":" "},null,null,null,null,null,null,{"$f":"IF(Sheet2!D56=\"xx\",\" \",Sheet2!D56)","v":" "},{"$f":"IF(Sheet2!E56=\"xx\",\" \",Sheet2!E56)","v":" "},{"$f":"IF(Sheet2!F56=\"xx\",\" \",Sheet2!F56)","v":" "},{"$f":"IF(Sheet2!G56=\"xx\",\" \",Sheet2!G56)","v":" "},{"$f":"IF(Sheet2!H56=\"xx\",\" \",Sheet2!H56)","v":" "},{"$f":"IF(Sheet2!I56=\"xx\",\" \",Sheet2!I56)","v":" "}]
[null,null,null,null,null,null,{"$f":"Sheet2!A57","v":"Continuous Output Torque - Nm"},{"$f":"IFERROR(IF(Sheet2!D57=0,\" \", Sheet2!D57),\" \")","v":" "},{"$f":"IFERROR(IF(Sheet2!E57=0,\" \", Sheet2!E57),\" \")","v":" "},{"$f":"IFERROR(IF(Sheet2!F57=0,\" \", Sheet2!F57),\" \")","v":" "},{"$f":"IFERROR(IF(Sheet2!G57=0,\" \", Sheet2!G57),\" \")","v":" "},{"$f":"IFERROR(IF(Sheet2!H57=0,\" \", Sheet2!H57),\" \")","v":" "},{"$f":"IFERROR(IF(Sheet2!I57=0,\" \", Sheet2!I57),\" \")","v":" "}]
[{"$f":"IF(D9=\" \", \" \",\"Ordering Code\")","v":" "},null,null,{"$f":"Sheet2!A18","v":" "},null,null,{"$f":"Sheet2!A58","v":"Intermittant Output Torque - Nm"},{"$f":"IFERROR(IF(Sheet2!D58=0,\" \", Sheet2!D58),\" \")","v":" "},{"$f":"IFERROR(IF(Sheet2!E58=0,\" \", Sheet2!E58),\" \")","v":" "},{"$f":"IFERROR(IF(Sheet2!F58=0,\" \", Sheet2!F58),\" \")","v":" "},{"$f":"IFERROR(IF(Sheet2!G58=0,\" \", Sheet2!G58),\" \")","v":" "},{"$f":"IFERROR(IF(Sheet2!H58=0,\" \", Sheet2!H58),\" \")","v":" "},{"$f":"IFERROR(IF(Sheet2!I58=0,\" \", Sheet2!I58),\" \")","v":" "}]
[null,null,null,null,null,null,{"$f":"Sheet2!A59","v":"Efficiency"},{"$f":"IFERROR(IF(Sheet2!D59=0,\" \", Sheet2!D59),\" \")","v":" "},{"$f":"IFERROR(IF(Sheet2!E59=0,\" \", Sheet2!E59),\" \")","v":" "},{"$f":"IFERROR(IF(Sheet2!F59=0,\" \", Sheet2!F59),\" \")","v":" "},{"$f":"IFERROR(IF(Sheet2!G59=0,\" \", Sheet2!G59),\" \")","v":" "},{"$f":"IFERROR(IF(Sheet2!H59=0,\" \", Sheet2!H59),\" \")","v":" "},{"$f":"IFERROR(IF(Sheet2!I59=0,\" \", Sheet2!I59),\" \")","v":" "}]
[{"$f":"IF(Sheet2!A22=TRUE,\" \",Sheet2!A20)","v":" "}]
[null,null,null,null,null,null,"Contact Details"]
[]
[null,null,null,null,null,null,"Name"]
[null,null,null,null,null,null,"Company"]
[null,null,null,null,null,null,"Telephone"]
[null,null,null,null,null,null,"Email"]
[]
[null,null,null,null,null,null,"Brief Description of Application"]
[]
[]
[]
[]
[]
[]
[]
[]
[]
[]
[]
[null,null,null,null,null,null,"Quantity Required"]
[]
[{"$f":"IF(A11=\" \",\" \",IF(Sheet2!D22=FALSE,\" \",\"Picture shows 19mm SGB. 50mm and 70mm feature 4 mounting holes in the face.\"))","v":" "},null,null,null,null,null,null,"Press \"Enter\" to finish inputting text prior to Emailing Enquiry "]
[{"$f":"IF(A11=\" \",\" \",IF(Sheet2!D22=FALSE,\" \",\"See Catalogue for Details.\"))","v":" "}]

{"sheet":"Sheet2","index":1,"n_rows":59,"n_cols":17,"rows_kept":59,"cut":false,"hidden":true,"merged":[]}
["Centre Distances","Ratios","Ratio",12,16,19,25,38,50,70,"Input Shaft","Output Shaft","Lubrication","Backlash"]
[]
[12,{"$f":"IF('SPIRADRIVE CONFIGURATOR'!$A$4=12,D3,IF('SPIRADRIVE CONFIGURATOR'!$A$4=16,E3,IF('SPIRADRIVE CONFIGURATOR'!$A$4=19,F3,IF('SPIRADRIVE CONFIGURATOR'!$A$4=25,G3,IF('SPIRADRIVE CONFIGURATOR'!$A$4=38,H3,IF('SPIRADRIVE CONFIGURATOR'!$A$4=50,I3,IF('SPIRADRIVE CONFIGURATOR'!$A$4=70,J3,)))))))","v":0},{"$f":"IF(B3=0,\"\",B3)","v":""},10.199999999999999,10.199999999999999,8.17,10.25,10.199999999999999,10.199999999999999,10.199999999999999,"Single","Left","Oil","Zero Backlash"]
[16,{"$f":"IF('SPIRADRIVE CONFIGURATOR'!$A$4=12,D4,IF('SPIRADRIVE CONFIGURATOR'!$A$4=16,E4,IF('SPIRADRIVE CONFIGURATOR'!$A$4=19,F4,IF('SPIRADRIVE CONFIGURATOR'!$A$4=25,G4,IF('SPIRADRIVE CONFIGURATOR'!$A$4=38,H4,IF('SPIRADRIVE CONFIGURATOR'!$A$4=50,I4,IF('SPIRADRIVE CONFIGURATOR'!$A$4=70,J4,)))))))","v":0},"",16.329999999999998,16.329999999999998,10.25,16.329999999999998,17.329999999999998,17.329999999999998,17.329999999999998,"Double","Right","Grease","3 minutes of arc - Bronze Gear"]
[19,{"$f":"IF('SPIRADRIVE CONFIGURATOR'!$A$4=12,D5,IF('SPIRADRIVE CONFIGURATOR'!$A$4=16,E5,IF('SPIRADRIVE CONFIGURATOR'!$A$4=19,F5,IF('SPIRADRIVE CONFIGURATOR'!$A$4=25,G5,IF('SPIRADRIVE CONFIGURATOR'!$A$4=38,H5,IF('SPIRADRIVE CONFIGURATOR'!$A$4=50,I5,IF('SPIRADRIVE CONFIGURATOR'!$A$4=70,J5,)))))))","v":0},"",25.5,25.5,12.33,25.5,25.5,25.5,25.5,null,"Hollow",null,"10 minutes of arc - Steel Gear"]
[25,{"$f":"IF('SPIRADRIVE CONFIGURATOR'!$A$4=12,D6,IF('SPIRADRIVE CONFIGURATOR'!$A$4=16,E6,IF('SPIRADRIVE CONFIGURATOR'!$A$4=19,F6,IF('SPIRADRIVE CONFIGURATOR'!$A$4=25,G6,IF('SPIRADRIVE CONFIGURATOR'!$A$4=38,H6,IF('SPIRADRIVE CONFIGURATOR'!$A$4=50,I6,IF('SPIRADRIVE CONFIGURATOR'!$A$4=70,J6,)))))))","v":0},"",36,36,25.5,36,31,38,36.5,null,"Double"]
[38,{"$f":"IF('SPIRADRIVE CONFIGURATOR'!$A$4=12,D7,IF('SPIRADRIVE CONFIGURATOR'!$A$4=16,E7,IF('SPIRADRIVE CONFIGURATOR'!$A$4=19,F7,IF('SPIRADRIVE CONFIGURATOR'!$A$4=25,G7,IF('SPIRADRIVE CONFIGURATOR'!$A$4=38,H7,IF('SPIRADRIVE CONFIGURATOR'!$A$4=50,I7,IF('SPIRADRIVE CONFIGURATOR'!$A$4=70,J7,)))))))","v":0},"",null,60,36,58,36.5,58,58]
[50,{"$f":"IF('SPIRADRIVE CONFIGURATOR'!$A$4=12,D8,IF('SPIRADRIVE CONFIGURATOR'!$A$4=16,E8,IF('SPIRADRIVE CONFIGURATOR'!$A$4=19,F8,IF('SPIRADRIVE CONFIGURATOR'!$A$4=25,G8,IF('SPIRADRIVE CONFIGURATOR'!$A$4=38,H8,IF('SPIRADRIVE CONFIGURATOR'!$A$4=50,I8,IF('SPIRADRIVE CONFIGURATOR'!$A$4=70,J8,)))))))","v":0},"",null,90,60,100,58,90,87]
[70,{"$f":"IF('SPIRADRIVE CONFIGURATOR'!$A$4=12,D9,IF('SPIRADRIVE CONFIGURATOR'!$A$4=16,E9,IF('SPIRADRIVE CONFIGURATOR'!$A$4=19,F9,IF('SPIRADRIVE CONFIGURATOR'!$A$4=25,G9,IF('SPIRADRIVE CONFIGURATOR'!$A$4=38,H9,IF('SPIRADRIVE CONFIGURATOR'!$A$4=50,I9,IF('SPIRADRIVE CONFIGURATOR'!$A$4=70,J9,)))))))","v":0},"",null,null,90,null,90,120,120]
[null,{"$f":"IF('SPIRADRIVE CONFIGURATOR'!$A$4=12,D10,IF('SPIRADRIVE CONFIGURATOR'!$A$4=16,E10,IF('SPIRADRIVE CONFIGURATOR'!$A$4=19,F10,IF('SPIRADRIVE CONFIGURATOR'!$A$4=25,G10,IF('SPIRADRIVE CONFIGURATOR'!$A$4=38,H10,IF('SPIRADRIVE CONFIGURATOR'!$A$4=50,I10,IF('SPIRADRIVE CONFIGURATOR'!$A$4=70,J10,)))))))","v":0},"",null,null,108,null,120]
[]
[]
[]
[]
[{"$f":"'SPIRADRIVE CONFIGURATOR'!A4","v":0},"SGB","-",{"$f":"'SPIRADRIVE CONFIGURATOR'!B4","v":0},":1","-",{"$f":"IF('SPIRADRIVE CONFIGURATOR'!D4=\"Single\",\"S\",IF('SPIRADRIVE CONFIGURATOR'!D4=\"Double\",\"D\",))","v":0},"-",{"$f":"IF('SPIRADRIVE CONFIGURATOR'!E4=\"Right\",\"R\",IF('SPIRADRIVE CONFIGURATOR'!E4=\"Left\",\"L\",IF('SPIRADRIVE CONFIGURATOR'!E4=\"Hollow\",\"H\",IF('SPIRADRIVE CONFIGURATOR'!E4=\"Double\",\"D\",))))","v":0},"-",{"$f":"IF('SPIRADRIVE CONFIGURATOR'!F4=\"Oil\",\"O\",IF('SPIRADRIVE CONFIGURATOR'!F4=\"Grease\",\"G\",))","v":0},"-",{"$f":"IF('SPIRADRIVE CONFIGURATOR'!G4=\"3 minutes of arc - Bronze Gear\",\"BL3\",IF('SPIRADRIVE CONFIGURATOR'!G4=\"10 minutes of arc - Steel Gear\",\"BL10\",IF('SPIRADRIVE CONFIGURATOR'!G4=\"Zero Backlash\",\"BL00\",)))","v":0}]
[]
["Detect Zeros",{"$f":"OR(A15=0,D15=0,G15=0,I15=0,K15=0,M15=0)","v":true},null,"Blank Before entry",null,{"$f":"AND(A15=0,D15=0,G15=0,I15=0,K15=0,M15=0)","v":true}]
[{"$f":"IF(F17=TRUE,\" \",IF(B17=TRUE,\"GEARBOX SPECIFICATION INCOMPLETE\",CONCATENATE(A15,B15,C15,D15,E15,F15,G15,H15,I15,J15,K15,L15,M15)))","v":" "}]
[]
[{"$f":"CONCATENATE(G15,I15)","v":"00"}]
[null,null,null,"Flag 50 or 70"]
[{"$f":"OR(G15=0,I15=0)","v":true},null,null,{"$f":"OR(A15=50,A15=70)","v":false}]
[]
[{"$f":"IF($A$15=$A$3,Sheet3!A3,IF($A$15=$A$4,Sheet3!A42,IF($A$15=$A$5,Sheet3!A82,IF($A$15=$A$6,Sheet3!A122,IF($A$15=$A$7,Sheet3!A162,IF($A$15=$A$8,Sheet3!A202,IF($A$15=$A$9,Sheet3!A240,\"XX\")))))))","v":"XX"},null,null,null,null,{"$f":"IF($A$15=$A$3,Sheet3!D3,IF($A$15=$A$4,Sheet3!D42,IF($A$15=$A$5,Sheet3!D82,IF($A$15=$A$6,Sheet3!D122,IF($A$15=$A$7,Sheet3!D162,IF($A$15=$A$8,Sheet3!D202,IF($A$15=$A$9,Sheet3!D242,\"XX\")))))))","v":"XX"},null,{"$f":"IF($A$15=$A$3,Sheet3!F3,IF($A$15=$A$4,Sheet3!F42,IF($A$15=$A$5,Sheet3!F82,IF($A$15=$A$6,Sheet3!F122,IF($A$15=$A$7,Sheet3!F162,IF($A$15=$A$8,Sheet3!F202,IF($A$15=$A$9,Sheet3!F242,\"XX\")))))))","v":"XX"},null,{"$f":"IF($A$15=$A$3,Sheet3!H3,IF($A$15=$A$4,Sheet3!H42,IF($A$15=$A$5,Sheet3!H82,IF($A$15=$A$6,Sheet3!H122,IF($A$15=$A$7,Sheet3!H162,IF($A$15=$A$8,Sheet3!H202,IF($A$15=$A$9,Sheet3!H242,\"XX\")))))))","v":"XX"},null,{"$f":"IF($A$15=$A$3,Sheet3!J3,IF($A$15=$A$4,Sheet3!J42,IF($A$15=$A$5,Sheet3!J82,IF($A$15=$A$6,Sheet3!J122,IF($A$15=$A$7,Sheet3!J162,IF($A$15=$A$8,Sheet3!J202,IF($A$15=$A$9,Sheet3!J242,\"XX\")))))))","v":"XX"},null,{"$f":"IF($A$15=$A$3,Sheet3!L3,IF($A$15=$A$4,Sheet3!L42,IF($A$15=$A$5,Sheet3!L82,IF($A$15=$A$6,Sheet3!L122,IF($A$15=$A$7,Sheet3!L162,IF($A$15=$A$8,Sheet3!L202,IF($A$15=$A$9,Sheet3!L242,\"XX\")))))))","v":"XX"},null,{"$f":"IF($A$15=$A$3,Sheet3!N3,IF($A$15=$A$4,Sheet3!N42,IF($A$15=$A$5,Sheet3!N82,IF($A$15=$A$6,Sheet3!N122,IF($A$15=$A$7,Sheet3!N162,IF($A$15=$A$8,Sheet3!N202,IF($A$15=$A$9,Sheet3!N242,\"XX\")))))))","v":"XX"}]
[null,null,null,{"$f":"IF($A$15=$A$3,Sheet3!B4,IF($A$15=$A$4,Sheet3!B43,IF($A$15=$A$5,Sheet3!B83,IF($A$15=$A$6,Sheet3!B123,IF($A$15=$A$7,Sheet3!B163,IF($A$15=$A$8,Sheet3!B203,IF($A$15=$A$9,Sheet3!B243,\"XX\")))))))","v":"XX"},null,{"$f":"IF($A$15=$A$3,Sheet3!D4,IF($A$15=$A$4,Sheet3!D43,IF($A$15=$A$5,Sheet3!D83,IF($A$15=$A$6,Sheet3!D123,IF($A$15=$A$7,Sheet3!D163,IF($A$15=$A$8,Sheet3!D203,IF($A$15=$A$9,Sheet3!D243,\"XX\")))))))","v":"XX"},{"$f":"IF($A$15=$A$3,Sheet3!E4,IF($A$15=$A$4,Sheet3!E43,IF($A$15=$A$5,Sheet3!E83,IF($A$15=$A$6,Sheet3!E123,IF($A$15=$A$7,Sheet3!E163,IF($A$15=$A$8,Sheet3!E203,IF($A$15=$A$9,Sheet3!E243,\"XX\")))))))","v":"XX"},{"$f":"IF($A$15=$A$3,Sheet3!F4,IF($A$15=$A$4,Sheet3!F43,IF($A$15=$A$5,Sheet3!F83,IF($A$15=$A$6,Sheet3!F123,IF($A$15=$A$7,Sheet3!F163,IF($A$15=$A$8,Sheet3!F203,IF($A$15=$A$9,Sheet3!F243,\"XX\")))))))","v":"XX"},{"$f":"IF($A$15=$A$3,Sheet3!G4,IF($A$15=$A$4,Sheet3!G43,IF($A$15=$A$5,Sheet3!G83,IF($A$15=$A$6,Sheet3!G123,IF($A$15=$A$7,Sheet3!G163,IF($A$15=$A$8,Sheet3!G203,IF($A$15=$A$9,Sheet3!G243,\"XX\")))))))","v":"XX"},{"$f":"IF($A$15=$A$3,Sheet3!H4,IF($A$15=$A$4,Sheet3!H43,IF($A$15=$A$5,Sheet3!H83,IF($A$15=$A$6,Sheet3!H123,IF($A$15=$A$7,Sheet3!H163,IF($A$15=$A$8,Sheet3!H203,IF($A$15=$A$9,Sheet3!H243,\"XX\")))))))","v":"XX"},{"$f":"IF($A$15=$A$3,Sheet3!I4,IF($A$15=$A$4,Sheet3!I43,IF($A$15=$A$5,Sheet3!I83,IF($A$15=$A$6,Sheet3!I123,IF($A$15=$A$7,Sheet3!I163,IF($A$15=$A$8,Sheet3!I203,IF($A$15=$A$9,Sheet3!I243,\"XX\")))))))","v":"XX"},{"$f":"IF($A$15=$A$3,Sheet3!J4,IF($A$15=$A$4,Sheet3!J43,IF($A$15=$A$5,Sheet3!J83,IF($A$15=$A$6,Sheet3!J123,IF($A$15=$A$7,Sheet3!J163,IF($A$15=$A$8,Sheet3!J203,IF($A$15=$A$9,Sheet3!J243,\"XX\")))))))","v":"XX"},{"$f":"IF($A$15=$A$3,Sheet3!K4,IF($A$15=$A$4,Sheet3!K43,IF($A$15=$A$5,Sheet3!K83,IF($A$15=$A$6,Sheet3!K123,IF($A$15=$A$7,Sheet3!K163,IF($A$15=$A$8,Sheet3!K203,IF($A$15=$A$9,Sheet3!K243,\"XX\")))))))","v":"XX"},{"$f":"IF($A$15=$A$3,Sheet3!L4,IF($A$15=$A$4,Sheet3!L43,IF($A$15=$A$5,Sheet3!L83,IF($A$15=$A$6,Sheet3!L123,IF($A$15=$A$7,Sheet3!L163,IF($A$15=$A$8,Sheet3!L203,IF($A$15=$A$9,Sheet3!L243,\"XX\")))))))","v":"XX"},{"$f":"IF($A$15=$A$3,Sheet3!M4,IF($A$15=$A$4,Sheet3!M43,IF($A$15=$A$5,Sheet3!M83,IF($A$15=$A$6,Sheet3!M123,IF($A$15=$A$7,Sheet3!M163,IF($A$15=$A$8,Sheet3!M203,IF($A$15=$A$9,Sheet3!M243,\"XX\")))))))","v":"XX"},{"$f":"IF($A$15=$A$3,Sheet3!N4,IF($A$15=$A$4,Sheet3!N43,IF($A$15=$A$5,Sheet3!N83,IF($A$15=$A$6,Sheet3!N123,IF($A$15=$A$7,Sheet3!N163,IF($A$15=$A$8,Sheet3!N203,IF($A$15=$A$9,Sheet3!N243,\"XX\")))))))","v":"XX"},{"$f":"IF($A$15=$A$3,Sheet3!O4,IF($A$15=$A$4,Sheet3!O43,IF($A$15=$A$5,Sheet3!O83,IF($A$15=$A$6,Sheet3!O123,IF($A$15=$A$7,Sheet3!O163,IF($A$15=$A$8,Sheet3!O203,IF($A$15=$A$9,Sheet3!O243,\"XX\")))))))","v":"XX"}]
[{"$f":"IF($A$15=$A$3,Sheet3!A6,IF($A$15=$A$4,Sheet3!A45,IF($A$15=$A$5,Sheet3!A85,IF($A$15=$A$6,Sheet3!A125,IF($A$15=$A$7,Sheet3!A165,IF($A$15=$A$8,Sheet3!A205,IF($A$15=$A$9,Sheet3!A245,\"XX\")))))))","v":"XX"},null,null,{"$f":"IF($A$15=$A$3,Sheet3!B5,IF($A$15=$A$4,Sheet3!B44,IF($A$15=$A$5,Sheet3!B84,IF($A$15=$A$6,Sheet3!B124,IF($A$15=$A$7,Sheet3!B164,IF($A$15=$A$8,Sheet3!B204,IF($A$15=$A$9,Sheet3!B244,\"XX\")))))))","v":"XX"},{"$f":"IF($A$15=$A$3,Sheet3!C5,IF($A$15=$A$4,Sheet3!C44,IF($A$15=$A$5,Sheet3!C84,IF($A$15=$A$6,Sheet3!C124,IF($A$15=$A$7,Sheet3!C164,IF($A$15=$A$8,Sheet3!C204,IF($A$15=$A$9,Sheet3!C244,\"XX\")))))))","v":"XX"},{"$f":"IF($A$15=$A$3,Sheet3!D5,IF($A$15=$A$4,Sheet3!D44,IF($A$15=$A$5,Sheet3!D84,IF($A$15=$A$6,Sheet3!D124,IF($A$15=$A$7,Sheet3!D164,IF($A$15=$A$8,Sheet3!D204,IF($A$15=$A$9,Sheet3!D244,\"XX\")))))))","v":"XX"},{"$f":"IF($A$15=$A$3,Sheet3!E5,IF($A$15=$A$4,Sheet3!E44,IF($A$15=$A$5,Sheet3!E84,IF($A$15=$A$6,Sheet3!E124,IF($A$15=$A$7,Sheet3!E164,IF($A$15=$A$8,Sheet3!E204,IF($A$15=$A$9,Sheet3!E244,\"XX\")))))))","v":"XX"},{"$f":"IF($A$15=$A$3,Sheet3!F5,IF($A$15=$A$4,Sheet3!F44,IF($A$15=$A$5,Sheet3!F84,IF($A$15=$A$6,Sheet3!F124,IF($A$15=$A$7,Sheet3!F164,IF($A$15=$A$8,Sheet3!F204,IF($A$15=$A$9,Sheet3!F244,\"XX\")))))))","v":"XX"},{"$f":"IF($A$15=$A$3,Sheet3!G5,IF($A$15=$A$4,Sheet3!G44,IF($A$15=$A$5,Sheet3!G84,IF($A$15=$A$6,Sheet3!G124,IF($A$15=$A$7,Sheet3!G164,IF($A$15=$A$8,Sheet3!G204,IF($A$15=$A$9,Sheet3!G244,\"XX\")))))))","v":"XX"},{"$f":"IF($A$15=$A$3,Sheet3!H5,IF($A$15=$A$4,Sheet3!H44,IF($A$15=$A$5,Sheet3!H84,IF($A$15=$A$6,Sheet3!H124,IF($A$15=$A$7,Sheet3!H164,IF($A$15=$A$8,Sheet3!H204,IF($A$15=$A$9,Sheet3!H244,\"XX\")))))))","v":"XX"},{"$f":"IF($A$15=$A$3,Sheet3!I5,IF($A$15=$A$4,Sheet3!I44,IF($A$15=$A$5,Sheet3!I84,IF($A$15=$A$6,Sheet3!I124,IF($A$15=$A$7,Sheet3!I164,IF($A$15=$A$8,Sheet3!I204,IF($A$15=$A$9,Sheet3!I244,\"XX\")))))))","v":"XX"},{"$f":"IF($A$15=$A$3,Sheet3!J5,IF($A$15=$A$4,Sheet3!J44,IF($A$15=$A$5,Sheet3!J84,IF($A$15=$A$6,Sheet3!J124,IF($A$15=$A$7,Sheet3!J164,IF($A$15=$A$8,Sheet3!J204,IF($A$15=$A$9,Sheet3!J244,\"XX\")))))))","v":"XX"},{"$f":"IF($A$15=$A$3,Sheet3!K5,IF($A$15=$A$4,Sheet3!K44,IF($A$15=$A$5,Sheet3!K84,IF($A$15=$A$6,Sheet3!K124,IF($A$15=$A$7,Sheet3!K164,IF($A$15=$A$8,Sheet3!K204,IF($A$15=$A$9,Sheet3!K244,\"XX\")))))))","v":"XX"},{"$f":"IF($A$15=$A$3,Sheet3!L5,IF($A$15=$A$4,Sheet3!L44,IF($A$15=$A$5,Sheet3!L84,IF($A$15=$A$6,Sheet3!L124,IF($A$15=$A$7,Sheet3!L164,IF($A$15=$A$8,Sheet3!L204,IF($A$15=$A$9,Sheet3!L244,\"XX\")))))))","v":"XX"},{"$f":"IF($A$15=$A$3,Sheet3!M5,IF($A$15=$A$4,Sheet3!M44,IF($A$15=$A$5,Sheet3!M84,IF($A$15=$A$6,Sheet3!M124,IF($A$15=$A$7,Sheet3!M164,IF($A$15=$A$8,Sheet3!M204,IF($A$15=$A$9,Sheet3!M244,\"XX\")))))))","v":"XX"},{"$f":"IF($A$15=$A$3,Sheet3!N5,IF($A$15=$A$4,Sheet3!N44,IF($A$15=$A$5,Sheet3!N84,IF($A$15=$A$6,Sheet3!N124,IF($A$15=$A$7,Sheet3!N164,IF($A$15=$A$8,Sheet3!N204,IF($A$15=$A$9,Sheet3!N244,\"XX\")))))))","v":"XX"},{"$f":"IF($A$15=$A$3,Sheet3!O5,IF($A$15=$A$4,Sheet3!O44,IF($A$15=$A$5,Sheet3!O84,IF($A$15=$A$6,Sheet3!O124,IF($A$15=$A$7,Sheet3!O164,IF($A$15=$A$8,Sheet3!O204,IF($A$15=$A$9,Sheet3!O244,\"XX\")))))))","v":"XX"}]
[null,{"$f":"A26","v":"XX"},null,{"$f":"IF($A$15=$A$3,Sheet3!B6,IF($A$15=$A$4,Sheet3!B45,IF($A$15=$A$5,Sheet3!B85,IF($A$15=$A$6,Sheet3!B125,IF($A$15=$A$7,Sheet3!B165,IF($A$15=$A$8,Sheet3!B205,IF($A$15=$A$9,Sheet3!B245,\"XX\")))))))","v":"XX"},{"$f":"IF($A$15=$A$3,Sheet3!C6,IF($A$15=$A$4,Sheet3!C45,IF($A$15=$A$5,Sheet3!C85,IF($A$15=$A$6,Sheet3!C125,IF($A$15=$A$7,Sheet3!C165,IF($A$15=$A$8,Sheet3!C205,IF($A$15=$A$9,Sheet3!C245,\"XX\")))))))","v":"XX"},{"$f":"IF($A$15=$A$3,Sheet3!D6,IF($A$15=$A$4,Sheet3!D45,IF($A$15=$A$5,Sheet3!D85,IF($A$15=$A$6,Sheet3!D125,IF($A$15=$A$7,Sheet3!D165,IF($A$15=$A$8,Sheet3!D205,IF($A$15=$A$9,Sheet3!D245,\"XX\")))))))","v":"XX"},{"$f":"IF($A$15=$A$3,Sheet3!E6,IF($A$15=$A$4,Sheet3!E45,IF($A$15=$A$5,Sheet3!E85,IF($A$15=$A$6,Sheet3!E125,IF($A$15=$A$7,Sheet3!E165,IF($A$15=$A$8,Sheet3!E205,IF($A$15=$A$9,Sheet3!E245,\"XX\")))))))","v":"XX"},{"$f":"IF($A$15=$A$3,Sheet3!F6,IF($A$15=$A$4,Sheet3!F45,IF($A$15=$A$5,Sheet3!F85,IF($A$15=$A$6,Sheet3!F125,IF($A$15=$A$7,Sheet3!F165,IF($A$15=$A$8,Sheet3!F205,IF($A$15=$A$9,Sheet3!F245,\"XX\")))))))","v":"XX"},{"$f":"IF($A$15=$A$3,Sheet3!G6,IF($A$15=$A$4,Sheet3!G45,IF($A$15=$A$5,Sheet3!G85,IF($A$15=$A$6,Sheet3!G125,IF($A$15=$A$7,Sheet3!G165,IF($A$15=$A$8,Sheet3!G205,IF($A$15=$A$9,Sheet3!G245,\"XX\")))))))","v":"XX"},{"$f":"IF($A$15=$A$3,Sheet3!H6,IF($A$15=$A$4,Sheet3!H45,IF($A$15=$A$5,Sheet3!H85,IF($A$15=$A$6,Sheet3!H125,IF($A$15=$A$7,Sheet3!H165,IF($A$15=$A$8,Sheet3!H205,IF($A$15=$A$9,Sheet3!H245,\"XX\")))))))","v":"XX"},{"$f":"IF($A$15=$A$3,Sheet3!I6,IF($A$15=$A$4,Sheet3!I45,IF($A$15=$A$5,Sheet3!I85,IF($A$15=$A$6,Sheet3!I125,IF($A$15=$A$7,Sheet3!I165,IF($A$15=$A$8,Sheet3!I205,IF($A$15=$A$9,Sheet3!I245,\"XX\")))))))","v":"XX"},{"$f":"IF($A$15=$A$3,Sheet3!J6,IF($A$15=$A$4,Sheet3!J45,IF($A$15=$A$5,Sheet3!J85,IF($A$15=$A$6,Sheet3!J125,IF($A$15=$A$7,Sheet3!J165,IF($A$15=$A$8,Sheet3!J205,IF($A$15=$A$9,Sheet3!J245,\"XX\")))))))","v":"XX"},{"$f":"IF($A$15=$A$3,Sheet3!K6,IF($A$15=$A$4,Sheet3!K45,IF($A$15=$A$5,Sheet3!K85,IF($A$15=$A$6,Sheet3!K125,IF($A$15=$A$7,Sheet3!K165,IF($A$15=$A$8,Sheet3!K205,IF($A$15=$A$9,Sheet3!K245,\"XX\")))))))","v":"XX"},{"$f":"IF($A$15=$A$3,Sheet3!L6,IF($A$15=$A$4,Sheet3!L45,IF($A$15=$A$5,Sheet3!L85,IF($A$15=$A$6,Sheet3!L125,IF($A$15=$A$7,Sheet3!L165,IF($A$15=$A$8,Sheet3!L205,IF($A$15=$A$9,Sheet3!L245,\"XX\")))))))","v":"XX"},{"$f":"IF($A$15=$A$3,Sheet3!M6,IF($A$15=$A$4,Sheet3!M45,IF($A$15=$A$5,Sheet3!M85,IF($A$15=$A$6,Sheet3!M125,IF($A$15=$A$7,Sheet3!M165,IF($A$15=$A$8,Sheet3!M205,IF($A$15=$A$9,Sheet3!M245,\"XX\")))))))","v":"XX"},{"$f":"IF($A$15=$A$3,Sheet3!N6,IF($A$15=$A$4,Sheet3!N45,IF($A$15=$A$5,Sheet3!N85,IF($A$15=$A$6,Sheet3!N125,IF($A$15=$A$7,Sheet3!N165,IF($A$15=$A$8,Sheet3!N205,IF($A$15=$A$9,Sheet3!N245,\"XX\")))))))","v":"XX"},{"$f":"IF($A$15=$A$3,Sheet3!O6,IF($A$15=$A$4,Sheet3!O45,IF($A$15=$A$5,Sheet3!O85,IF($A$15=$A$6,Sheet3!O125,IF($A$15=$A$7,Sheet3!O165,IF($A$15=$A$8,Sheet3!O205,IF($A$15=$A$9,Sheet3!O245,\"XX\")))))))","v":"XX"}]
[null,null,{"$f":"B27","v":"XX"},{"$f":"IF($A$15=$A$3,Sheet3!B7,IF($A$15=$A$4,Sheet3!B46,IF($A$15=$A$5,Sheet3!B86,IF($A$15=$A$6,Sheet3!B126,IF($A$15=$A$7,Sheet3!B166,IF($A$15=$A$8,Sheet3!B206,IF($A$15=$A$9,Sheet3!B246,\"XX\")))))))","v":"XX"},{"$f":"IF($A$15=$A$3,Sheet3!C7,IF($A$15=$A$4,Sheet3!C46,IF($A$15=$A$5,Sheet3!C86,IF($A$15=$A$6,Sheet3!C126,IF($A$15=$A$7,Sheet3!C166,IF($A$15=$A$8,Sheet3!C206,IF($A$15=$A$9,Sheet3!C246,\"XX\")))))))","v":"XX"},{"$f":"IF($A$15=$A$3,Sheet3!D7,IF($A$15=$A$4,Sheet3!D46,IF($A$15=$A$5,Sheet3!D86,IF($A$15=$A$6,Sheet3!D126,IF($A$15=$A$7,Sheet3!D166,IF($A$15=$A$8,Sheet3!D206,IF($A$15=$A$9,Sheet3!D246,\"XX\")))))))","v":"XX"},{"$f":"IF($A$15=$A$3,Sheet3!E7,IF($A$15=$A$4,Sheet3!E46,IF($A$15=$A$5,Sheet3!E86,IF($A$15=$A$6,Sheet3!E126,IF($A$15=$A$7,Sheet3!E166,IF($A$15=$A$8,Sheet3!E206,IF($A$15=$A$9,Sheet3!E246,\"XX\")))))))","v":"XX"},{"$f":"IF($A$15=$A$3,Sheet3!F7,IF($A$15=$A$4,Sheet3!F46,IF($A$15=$A$5,Sheet3!F86,IF($A$15=$A$6,Sheet3!F126,IF($A$15=$A$7,Sheet3!F166,IF($A$15=$A$8,Sheet3!F206,IF($A$15=$A$9,Sheet3!F246,\"XX\")))))))","v":"XX"},{"$f":"IF($A$15=$A$3,Sheet3!G7,IF($A$15=$A$4,Sheet3!G46,IF($A$15=$A$5,Sheet3!G86,IF($A$15=$A$6,Sheet3!G126,IF($A$15=$A$7,Sheet3!G166,IF($A$15=$A$8,Sheet3!G206,IF($A$15=$A$9,Sheet3!G246,\"XX\")))))))","v":"XX"},{"$f":"IF($A$15=$A$3,Sheet3!H7,IF($A$15=$A$4,Sheet3!H46,IF($A$15=$A$5,Sheet3!H86,IF($A$15=$A$6,Sheet3!H126,IF($A$15=$A$7,Sheet3!H166,IF($A$15=$A$8,Sheet3!H206,IF($A$15=$A$9,Sheet3!H246,\"XX\")))))))","v":"XX"},{"$f":"IF($A$15=$A$3,Sheet3!I7,IF($A$15=$A$4,Sheet3!I46,IF($A$15=$A$5,Sheet3!I86,IF($A$15=$A$6,Sheet3!I126,IF($A$15=$A$7,Sheet3!I166,IF($A$15=$A$8,Sheet3!I206,IF($A$15=$A$9,Sheet3!I246,\"XX\")))))))","v":"XX"},{"$f":"IF($A$15=$A$3,Sheet3!J7,IF($A$15=$A$4,Sheet3!J46,IF($A$15=$A$5,Sheet3!J86,IF($A$15=$A$6,Sheet3!J126,IF($A$15=$A$7,Sheet3!J166,IF($A$15=$A$8,Sheet3!J206,IF($A$15=$A$9,Sheet3!J246,\"XX\")))))))","v":"XX"},{"$f":"IF($A$15=$A$3,Sheet3!K7,IF($A$15=$A$4,Sheet3!K46,IF($A$15=$A$5,Sheet3!K86,IF($A$15=$A$6,Sheet3!K126,IF($A$15=$A$7,Sheet3!K166,IF($A$15=$A$8,Sheet3!K206,IF($A$15=$A$9,Sheet3!K246,\"XX\")))))))","v":"XX"},{"$f":"IF($A$15=$A$3,Sheet3!L7,IF($A$15=$A$4,Sheet3!L46,IF($A$15=$A$5,Sheet3!L86,IF($A$15=$A$6,Sheet3!L126,IF($A$15=$A$7,Sheet3!L166,IF($A$15=$A$8,Sheet3!L206,IF($A$15=$A$9,Sheet3!L246,\"XX\")))))))","v":"XX"},{"$f":"IF($A$15=$A$3,Sheet3!M7,IF($A$15=$A$4,Sheet3!M46,IF($A$15=$A$5,Sheet3!M86,IF($A$15=$A$6,Sheet3!M126,IF($A$15=$A$7,Sheet3!M166,IF($A$15=$A$8,Sheet3!M206,IF($A$15=$A$9,Sheet3!M246,\"XX\")))))))","v":"XX"},{"$f":"IF($A$15=$A$3,Sheet3!N7,IF($A$15=$A$4,Sheet3!N46,IF($A$15=$A$5,Sheet3!N86,IF($A$15=$A$6,Sheet3!N126,IF($A$15=$A$7,Sheet3!N166,IF($A$15=$A$8,Sheet3!N206,IF($A$15=$A$9,Sheet3!N246,\"XX\")))))))","v":"XX"},{"$f":"IF($A$15=$A$3,Sheet3!O7,IF($A$15=$A$4,Sheet3!O46,IF($A$15=$A$5,Sheet3!O86,IF($A$15=$A$6,Sheet3!O126,IF($A$15=$A$7,Sheet3!O166,IF($A$15=$A$8,Sheet3!O206,IF($A$15=$A$9,Sheet3!O246,\"XX\")))))))","v":"XX"}]
[{"$f":"IF($A$15=$A$3,Sheet3!A9,IF($A$15=$A$4,Sheet3!A48,IF($A$15=$A$5,Sheet3!A88,IF($A$15=$A$6,Sheet3!A128,IF($A$15=$A$7,Sheet3!A168,IF($A$15=$A$8,Sheet3!A208,IF($A$15=$A$9,Sheet3!A248,\"XX\")))))))","v":"XX"},null,null,{"$f":"IF($A$15=$A$3,Sheet3!B8,IF($A$15=$A$4,Sheet3!B47,IF($A$15=$A$5,Sheet3!B87,IF($A$15=$A$6,Sheet3!B127,IF($A$15=$A$7,Sheet3!B167,IF($A$15=$A$8,Sheet3!B207,IF($A$15=$A$9,Sheet3!B247,\"XX\")))))))","v":"XX"},{"$f":"IF($A$15=$A$3,Sheet3!C8,IF($A$15=$A$4,Sheet3!C47,IF($A$15=$A$5,Sheet3!C87,IF($A$15=$A$6,Sheet3!C127,IF($A$15=$A$7,Sheet3!C167,IF($A$15=$A$8,Sheet3!C207,IF($A$15=$A$9,Sheet3!C247,\"XX\")))))))","v":"XX"},{"$f":"IF($A$15=$A$3,Sheet3!D8,IF($A$15=$A$4,Sheet3!D47,IF($A$15=$A$5,Sheet3!D87,IF($A$15=$A$6,Sheet3!D127,IF($A$15=$A$7,Sheet3!D167,IF($A$15=$A$8,Sheet3!D207,IF($A$15=$A$9,Sheet3!D247,\"XX\")))))))","v":"XX"},{"$f":"IF($A$15=$A$3,Sheet3!E8,IF($A$15=$A$4,Sheet3!E47,IF($A$15=$A$5,Sheet3!E87,IF($A$15=$A$6,Sheet3!E127,IF($A$15=$A$7,Sheet3!E167,IF($A$15=$A$8,Sheet3!E207,IF($A$15=$A$9,Sheet3!E247,\"XX\")))))))","v":"XX"},{"$f":"IF($A$15=$A$3,Sheet3!F8,IF($A$15=$A$4,Sheet3!F47,IF($A$15=$A$5,Sheet3!F87,IF($A$15=$A$6,Sheet3!F127,IF($A$15=$A$7,Sheet3!F167,IF($A$15=$A$8,Sheet3!F207,IF($A$15=$A$9,Sheet3!F247,\"XX\")))))))","v":"XX"},{"$f":"IF($A$15=$A$3,Sheet3!G8,IF($A$15=$A$4,Sheet3!G47,IF($A$15=$A$5,Sheet3!G87,IF($A$15=$A$6,Sheet3!G127,IF($A$15=$A$7,Sheet3!G167,IF($A$15=$A$8,Sheet3!G207,IF($A$15=$A$9,Sheet3!G247,\"XX\")))))))","v":"XX"},{"$f":"IF($A$15=$A$3,Sheet3!H8,IF($A$15=$A$4,Sheet3!H47,IF($A$15=$A$5,Sheet3!H87,IF($A$15=$A$6,Sheet3!H127,IF($A$15=$A$7,Sheet3!H167,IF($A$15=$A$8,Sheet3!H207,IF($A$15=$A$9,Sheet3!H247,\"XX\")))))))","v":"XX"},{"$f":"IF($A$15=$A$3,Sheet3!I8,IF($A$15=$A$4,Sheet3!I47,IF($A$15=$A$5,Sheet3!I87,IF($A$15=$A$6,Sheet3!I127,IF($A$15=$A$7,Sheet3!I167,IF($A$15=$A$8,Sheet3!I207,IF($A$15=$A$9,Sheet3!I247,\"XX\")))))))","v":"XX"},{"$f":"IF($A$15=$A$3,Sheet3!J8,IF($A$15=$A$4,Sheet3!J47,IF($A$15=$A$5,Sheet3!J87,IF($A$15=$A$6,Sheet3!J127,IF($A$15=$A$7,Sheet3!J167,IF($A$15=$A$8,Sheet3!J207,IF($A$15=$A$9,Sheet3!J247,\"XX\")))))))","v":"XX"},{"$f":"IF($A$15=$A$3,Sheet3!K8,IF($A$15=$A$4,Sheet3!K47,IF($A$15=$A$5,Sheet3!K87,IF($A$15=$A$6,Sheet3!K127,IF($A$15=$A$7,Sheet3!K167,IF($A$15=$A$8,Sheet3!K207,IF($A$15=$A$9,Sheet3!K247,\"XX\")))))))","v":"XX"},{"$f":"IF($A$15=$A$3,Sheet3!L8,IF($A$15=$A$4,Sheet3!L47,IF($A$15=$A$5,Sheet3!L87,IF($A$15=$A$6,Sheet3!L127,IF($A$15=$A$7,Sheet3!L167,IF($A$15=$A$8,Sheet3!L207,IF($A$15=$A$9,Sheet3!L247,\"XX\")))))))","v":"XX"},{"$f":"IF($A$15=$A$3,Sheet3!M8,IF($A$15=$A$4,Sheet3!M47,IF($A$15=$A$5,Sheet3!M87,IF($A$15=$A$6,Sheet3!M127,IF($A$15=$A$7,Sheet3!M167,IF($A$15=$A$8,Sheet3!M207,IF($A$15=$A$9,Sheet3!M247,\"XX\")))))))","v":"XX"},{"$f":"IF($A$15=$A$3,Sheet3!N8,IF($A$15=$A$4,Sheet3!N47,IF($A$15=$A$5,Sheet3!N87,IF($A$15=$A$6,Sheet3!N127,IF($A$15=$A$7,Sheet3!N167,IF($A$15=$A$8,Sheet3!N207,IF($A$15=$A$9,Sheet3!N247,\"XX\")))))))","v":"XX"},{"$f":"IF($A$15=$A$3,Sheet3!O8,IF($A$15=$A$4,Sheet3!O47,IF($A$15=$A$5,Sheet3!O87,IF($A$15=$A$6,Sheet3!O127,IF($A$15=$A$7,Sheet3!O167,IF($A$15=$A$8,Sheet3!O207,IF($A$15=$A$9,Sheet3!O247,\"XX\")))))))","v":"XX"}]
[null,{"$f":"A29","v":"XX"},null,{"$f":"IF($A$15=$A$3,Sheet3!B9,IF($A$15=$A$4,Sheet3!B48,IF($A$15=$A$5,Sheet3!B88,IF($A$15=$A$6,Sheet3!B128,IF($A$15=$A$7,Sheet3!B168,IF($A$15=$A$8,Sheet3!B208,IF($A$15=$A$9,Sheet3!B248,\"XX\")))))))","v":"XX"},{"$f":"IF($A$15=$A$3,Sheet3!C9,IF($A$15=$A$4,Sheet3!C48,IF($A$15=$A$5,Sheet3!C88,IF($A$15=$A$6,Sheet3!C128,IF($A$15=$A$7,Sheet3!C168,IF($A$15=$A$8,Sheet3!C208,IF($A$15=$A$9,Sheet3!C248,\"XX\")))))))","v":"XX"},{"$f":"IF($A$15=$A$3,Sheet3!D9,IF($A$15=$A$4,Sheet3!D48,IF($A$15=$A$5,Sheet3!D88,IF($A$15=$A$6,Sheet3!D128,IF($A$15=$A$7,Sheet3!D168,IF($A$15=$A$8,Sheet3!D208,IF($A$15=$A$9,Sheet3!D248,\"XX\")))))))","v":"XX"},{"$f":"IF($A$15=$A$3,Sheet3!E9,IF($A$15=$A$4,Sheet3!E48,IF($A$15=$A$5,Sheet3!E88,IF($A$15=$A$6,Sheet3!E128,IF($A$15=$A$7,Sheet3!E168,IF($A$15=$A$8,Sheet3!E208,IF($A$15=$A$9,Sheet3!E248,\"XX\")))))))","v":"XX"},{"$f":"IF($A$15=$A$3,Sheet3!F9,IF($A$15=$A$4,Sheet3!F48,IF($A$15=$A$5,Sheet3!F88,IF($A$15=$A$6,Sheet3!F128,IF($A$15=$A$7,Sheet3!F168,IF($A$15=$A$8,Sheet3!F208,IF($A$15=$A$9,Sheet3!F248,\"XX\")))))))","v":"XX"},{"$f":"IF($A$15=$A$3,Sheet3!G9,IF($A$15=$A$4,Sheet3!G48,IF($A$15=$A$5,Sheet3!G88,IF($A$15=$A$6,Sheet3!G128,IF($A$15=$A$7,Sheet3!G168,IF($A$15=$A$8,Sheet3!G208,IF($A$15=$A$9,Sheet3!G248,\"XX\")))))))","v":"XX"},{"$f":"IF($A$15=$A$3,Sheet3!H9,IF($A$15=$A$4,Sheet3!H48,IF($A$15=$A$5,Sheet3!H88,IF($A$15=$A$6,Sheet3!H128,IF($A$15=$A$7,Sheet3!H168,IF($A$15=$A$8,Sheet3!H208,IF($A$15=$A$9,Sheet3!H248,\"XX\")))))))","v":"XX"},{"$f":"IF($A$15=$A$3,Sheet3!I9,IF($A$15=$A$4,Sheet3!I48,IF($A$15=$A$5,Sheet3!I88,IF($A$15=$A$6,Sheet3!I128,IF($A$15=$A$7,Sheet3!I168,IF($A$15=$A$8,Sheet3!I208,IF($A$15=$A$9,Sheet3!I248,\"XX\")))))))","v":"XX"},{"$f":"IF($A$15=$A$3,Sheet3!J9,IF($A$15=$A$4,Sheet3!J48,IF($A$15=$A$5,Sheet3!J88,IF($A$15=$A$6,Sheet3!J128,IF($A$15=$A$7,Sheet3!J168,IF($A$15=$A$8,Sheet3!J208,IF($A$15=$A$9,Sheet3!J248,\"XX\")))))))","v":"XX"},{"$f":"IF($A$15=$A$3,Sheet3!K9,IF($A$15=$A$4,Sheet3!K48,IF($A$15=$A$5,Sheet3!K88,IF($A$15=$A$6,Sheet3!K128,IF($A$15=$A$7,Sheet3!K168,IF($A$15=$A$8,Sheet3!K208,IF($A$15=$A$9,Sheet3!K248,\"XX\")))))))","v":"XX"},{"$f":"IF($A$15=$A$3,Sheet3!L9,IF($A$15=$A$4,Sheet3!L48,IF($A$15=$A$5,Sheet3!L88,IF($A$15=$A$6,Sheet3!L128,IF($A$15=$A$7,Sheet3!L168,IF($A$15=$A$8,Sheet3!L208,IF($A$15=$A$9,Sheet3!L248,\"XX\")))))))","v":"XX"},{"$f":"IF($A$15=$A$3,Sheet3!M9,IF($A$15=$A$4,Sheet3!M48,IF($A$15=$A$5,Sheet3!M88,IF($A$15=$A$6,Sheet3!M128,IF($A$15=$A$7,Sheet3!M168,IF($A$15=$A$8,Sheet3!M208,IF($A$15=$A$9,Sheet3!M248,\"XX\")))))))","v":"XX"},{"$f":"IF($A$15=$A$3,Sheet3!N9,IF($A$15=$A$4,Sheet3!N48,IF($A$15=$A$5,Sheet3!N88,IF($A$15=$A$6,Sheet3!N128,IF($A$15=$A$7,Sheet3!N168,IF($A$15=$A$8,Sheet3!N208,IF($A$15=$A$9,Sheet3!N248,\"XX\")))))))","v":"XX"},{"$f":"IF($A$15=$A$3,Sheet3!O9,IF($A$15=$A$4,Sheet3!O48,IF($A$15=$A$5,Sheet3!O88,IF($A$15=$A$6,Sheet3!O128,IF($A$15=$A$7,Sheet3!O168,IF($A$15=$A$8,Sheet3!O208,IF($A$15=$A$9,Sheet3!O248,\"XX\")))))))","v":"XX"}]
[null,null,{"$f":"B30","v":"XX"},{"$f":"IF($A$15=$A$3,Sheet3!B10,IF($A$15=$A$4,Sheet3!B49,IF($A$15=$A$5,Sheet3!B89,IF($A$15=$A$6,Sheet3!B129,IF($A$15=$A$7,Sheet3!B169,IF($A$15=$A$8,Sheet3!B209,IF($A$15=$A$9,Sheet3!B249,\"XX\")))))))","v":"XX"},{"$f":"IF($A$15=$A$3,Sheet3!C10,IF($A$15=$A$4,Sheet3!C49,IF($A$15=$A$5,Sheet3!C89,IF($A$15=$A$6,Sheet3!C129,IF($A$15=$A$7,Sheet3!C169,IF($A$15=$A$8,Sheet3!C209,IF($A$15=$A$9,Sheet3!C249,\"XX\")))))))","v":"XX"},{"$f":"IF($A$15=$A$3,Sheet3!D10,IF($A$15=$A$4,Sheet3!D49,IF($A$15=$A$5,Sheet3!D89,IF($A$15=$A$6,Sheet3!D129,IF($A$15=$A$7,Sheet3!D169,IF($A$15=$A$8,Sheet3!D209,IF($A$15=$A$9,Sheet3!D249,\"XX\")))))))","v":"XX"},{"$f":"IF($A$15=$A$3,Sheet3!E10,IF($A$15=$A$4,Sheet3!E49,IF($A$15=$A$5,Sheet3!E89,IF($A$15=$A$6,Sheet3!E129,IF($A$15=$A$7,Sheet3!E169,IF($A$15=$A$8,Sheet3!E209,IF($A$15=$A$9,Sheet3!E249,\"XX\")))))))","v":"XX"},{"$f":"IF($A$15=$A$3,Sheet3!F10,IF($A$15=$A$4,Sheet3!F49,IF($A$15=$A$5,Sheet3!F89,IF($A$15=$A$6,Sheet3!F129,IF($A$15=$A$7,Sheet3!F169,IF($A$15=$A$8,Sheet3!F209,IF($A$15=$A$9,Sheet3!F249,\"XX\")))))))","v":"XX"},{"$f":"IF($A$15=$A$3,Sheet3!G10,IF($A$15=$A$4,Sheet3!G49,IF($A$15=$A$5,Sheet3!G89,IF($A$15=$A$6,Sheet3!G129,IF($A$15=$A$7,Sheet3!G169,IF($A$15=$A$8,Sheet3!G209,IF($A$15=$A$9,Sheet3!G249,\"XX\")))))))","v":"XX"},{"$f":"IF($A$15=$A$3,Sheet3!H10,IF($A$15=$A$4,Sheet3!H49,IF($A$15=$A$5,Sheet3!H89,IF($A$15=$A$6,Sheet3!H129,IF($A$15=$A$7,Sheet3!H169,IF($A$15=$A$8,Sheet3!H209,IF($A$15=$A$9,Sheet3!H249,\"XX\")))))))","v":"XX"},{"$f":"IF($A$15=$A$3,Sheet3!I10,IF($A$15=$A$4,Sheet3!I49,IF($A$15=$A$5,Sheet3!I89,IF($A$15=$A$6,Sheet3!I129,IF($A$15=$A$7,Sheet3!I169,IF($A$15=$A$8,Sheet3!I209,IF($A$15=$A$9,Sheet3!I249,\"XX\")))))))","v":"XX"},{"$f":"IF($A$15=$A$3,Sheet3!J10,IF($A$15=$A$4,Sheet3!J49,IF($A$15=$A$5,Sheet3!J89,IF($A$15=$A$6,Sheet3!J129,IF($A$15=$A$7,Sheet3!J169,IF($A$15=$A$8,Sheet3!J209,IF($A$15=$A$9,Sheet3!J249,\"XX\")))))))","v":"XX"},{"$f":"IF($A$15=$A$3,Sheet3!K10,IF($A$15=$A$4,Sheet3!K49,IF($A$15=$A$5,Sheet3!K89,IF($A$15=$A$6,Sheet3!K129,IF($A$15=$A$7,Sheet3!K169,IF($A$15=$A$8,Sheet3!K209,IF($A$15=$A$9,Sheet3!K249,\"XX\")))))))","v":"XX"},{"$f":"IF($A$15=$A$3,Sheet3!L10,IF($A$15=$A$4,Sheet3!L49,IF($A$15=$A$5,Sheet3!L89,IF($A$15=$A$6,Sheet3!L129,IF($A$15=$A$7,Sheet3!L169,IF($A$15=$A$8,Sheet3!L209,IF($A$15=$A$9,Sheet3!L249,\"XX\")))))))","v":"XX"},{"$f":"IF($A$15=$A$3,Sheet3!M10,IF($A$15=$A$4,Sheet3!M49,IF($A$15=$A$5,Sheet3!M89,IF($A$15=$A$6,Sheet3!M129,IF($A$15=$A$7,Sheet3!M169,IF($A$15=$A$8,Sheet3!M209,IF($A$15=$A$9,Sheet3!M249,\"XX\")))))))","v":"XX"},{"$f":"IF($A$15=$A$3,Sheet3!N10,IF($A$15=$A$4,Sheet3!N49,IF($A$15=$A$5,Sheet3!N89,IF($A$15=$A$6,Sheet3!N129,IF($A$15=$A$7,Sheet3!N169,IF($A$15=$A$8,Sheet3!N209,IF($A$15=$A$9,Sheet3!N249,\"XX\")))))))","v":"XX"},{"$f":"IF($A$15=$A$3,Sheet3!O10,IF($A$15=$A$4,Sheet3!O49,IF($A$15=$A$5,Sheet3!O89,IF($A$15=$A$6,Sheet3!O129,IF($A$15=$A$7,Sheet3!O169,IF($A$15=$A$8,Sheet3!O209,IF($A$15=$A$9,Sheet3!O249,\"XX\")))))))","v":"XX"}]
[{"$f":"IF($A$15=$A$3,Sheet3!A12,IF($A$15=$A$4,Sheet3!A51,IF($A$15=$A$5,Sheet3!A91,IF($A$15=$A$6,Sheet3!A131,IF($A$15=$A$7,Sheet3!A171,IF($A$15=$A$8,Sheet3!A211,IF($A$15=$A$9,Sheet3!A251,\"XX\")))))))","v":"XX"},null,null,{"$f":"IF($A$15=$A$3,Sheet3!B11,IF($A$15=$A$4,Sheet3!B50,IF($A$15=$A$5,Sheet3!B90,IF($A$15=$A$6,Sheet3!B130,IF($A$15=$A$7,Sheet3!B170,IF($A$15=$A$8,Sheet3!B210,IF($A$15=$A$9,Sheet3!B250,\"XX\")))))))","v":"XX"},{"$f":"IF($A$15=$A$3,Sheet3!C11,IF($A$15=$A$4,Sheet3!C50,IF($A$15=$A$5,Sheet3!C90,IF($A$15=$A$6,Sheet3!C130,IF($A$15=$A$7,Sheet3!C170,IF($A$15=$A$8,Sheet3!C210,IF($A$15=$A$9,Sheet3!C250,\"XX\")))))))","v":"XX"},{"$f":"IF($A$15=$A$3,Sheet3!D11,IF($A$15=$A$4,Sheet3!D50,IF($A$15=$A$5,Sheet3!D90,IF($A$15=$A$6,Sheet3!D130,IF($A$15=$A$7,Sheet3!D170,IF($A$15=$A$8,Sheet3!D210,IF($A$15=$A$9,Sheet3!D250,\"XX\")))))))","v":"XX"},{"$f":"IF($A$15=$A$3,Sheet3!E11,IF($A$15=$A$4,Sheet3!E50,IF($A$15=$A$5,Sheet3!E90,IF($A$15=$A$6,Sheet3!E130,IF($A$15=$A$7,Sheet3!E170,IF($A$15=$A$8,Sheet3!E210,IF($A$15=$A$9,Sheet3!E250,\"XX\")))))))","v":"XX"},{"$f":"IF($A$15=$A$3,Sheet3!F11,IF($A$15=$A$4,Sheet3!F50,IF($A$15=$A$5,Sheet3!F90,IF($A$15=$A$6,Sheet3!F130,IF($A$15=$A$7,Sheet3!F170,IF($A$15=$A$8,Sheet3!F210,IF($A$15=$A$9,Sheet3!F250,\"XX\")))))))","v":"XX"},{"$f":"IF($A$15=$A$3,Sheet3!G11,IF($A$15=$A$4,Sheet3!G50,IF($A$15=$A$5,Sheet3!G90,IF($A$15=$A$6,Sheet3!G130,IF($A$15=$A$7,Sheet3!G170,IF($A$15=$A$8,Sheet3!G210,IF($A$15=$A$9,Sheet3!G250,\"XX\")))))))","v":"XX"},{"$f":"IF($A$15=$A$3,Sheet3!H11,IF($A$15=$A$4,Sheet3!H50,IF($A$15=$A$5,Sheet3!H90,IF($A$15=$A$6,Sheet3!H130,IF($A$15=$A$7,Sheet3!H170,IF($A$15=$A$8,Sheet3!H210,IF($A$15=$A$9,Sheet3!H250,\"XX\")))))))","v":"XX"},{"$f":"IF($A$15=$A$3,Sheet3!I11,IF($A$15=$A$4,Sheet3!I50,IF($A$15=$A$5,Sheet3!I90,IF($A$15=$A$6,Sheet3!I130,IF($A$15=$A$7,Sheet3!I170,IF($A$15=$A$8,Sheet3!I210,IF($A$15=$A$9,Sheet3!I250,\"XX\")))))))","v":"XX"},{"$f":"IF($A$15=$A$3,Sheet3!J11,IF($A$15=$A$4,Sheet3!J50,IF($A$15=$A$5,Sheet3!J90,IF($A$15=$A$6,Sheet3!J130,IF($A$15=$A$7,Sheet3!J170,IF($A$15=$A$8,Sheet3!J210,IF($A$15=$A$9,Sheet3!J250,\"XX\")))))))","v":"XX"},{"$f":"IF($A$15=$A$3,Sheet3!K11,IF($A$15=$A$4,Sheet3!K50,IF($A$15=$A$5,Sheet3!K90,IF($A$15=$A$6,Sheet3!K130,IF($A$15=$A$7,Sheet3!K170,IF($A$15=$A$8,Sheet3!K210,IF($A$15=$A$9,Sheet3!K250,\"XX\")))))))","v":"XX"},{"$f":"IF($A$15=$A$3,Sheet3!L11,IF($A$15=$A$4,Sheet3!L50,IF($A$15=$A$5,Sheet3!L90,IF($A$15=$A$6,Sheet3!L130,IF($A$15=$A$7,Sheet3!L170,IF($A$15=$A$8,Sheet3!L210,IF($A$15=$A$9,Sheet3!L250,\"XX\")))))))","v":"XX"},{"$f":"IF($A$15=$A$3,Sheet3!M11,IF($A$15=$A$4,Sheet3!M50,IF($A$15=$A$5,Sheet3!M90,IF($A$15=$A$6,Sheet3!M130,IF($A$15=$A$7,Sheet3!M170,IF($A$15=$A$8,Sheet3!M210,IF($A$15=$A$9,Sheet3!M250,\"XX\")))))))","v":"XX"},{"$f":"IF($A$15=$A$3,Sheet3!N11,IF($A$15=$A$4,Sheet3!N50,IF($A$15=$A$5,Sheet3!N90,IF($A$15=$A$6,Sheet3!N130,IF($A$15=$A$7,Sheet3!N170,IF($A$15=$A$8,Sheet3!N210,IF($A$15=$A$9,Sheet3!N250,\"XX\")))))))","v":"XX"},{"$f":"IF($A$15=$A$3,Sheet3!O11,IF($A$15=$A$4,Sheet3!O50,IF($A$15=$A$5,Sheet3!O90,IF($A$15=$A$6,Sheet3!O130,IF($A$15=$A$7,Sheet3!O170,IF($A$15=$A$8,Sheet3!O210,IF($A$15=$A$9,Sheet3!O250,\"XX\")))))))","v":"XX"}]
[null,{"$f":"A32","v":"XX"},null,{"$f":"IF($A$15=$A$3,Sheet3!B12,IF($A$15=$A$4,Sheet3!B51,IF($A$15=$A$5,Sheet3!B91,IF($A$15=$A$6,Sheet3!B131,IF($A$15=$A$7,Sheet3!B171,IF($A$15=$A$8,Sheet3!B211,IF($A$15=$A$9,Sheet3!B251,\"XX\")))))))","v":"XX"},{"$f":"IF($A$15=$A$3,Sheet3!C12,IF($A$15=$A$4,Sheet3!C51,IF($A$15=$A$5,Sheet3!C91,IF($A$15=$A$6,Sheet3!C131,IF($A$15=$A$7,Sheet3!C171,IF($A$15=$A$8,Sheet3!C211,IF($A$15=$A$9,Sheet3!C251,\"XX\")))))))","v":"XX"},{"$f":"IF($A$15=$A$3,Sheet3!D12,IF($A$15=$A$4,Sheet3!D51,IF($A$15=$A$5,Sheet3!D91,IF($A$15=$A$6,Sheet3!D131,IF($A$15=$A$7,Sheet3!D171,IF($A$15=$A$8,Sheet3!D211,IF($A$15=$A$9,Sheet3!D251,\"XX\")))))))","v":"XX"},{"$f":"IF($A$15=$A$3,Sheet3!E12,IF($A$15=$A$4,Sheet3!E51,IF($A$15=$A$5,Sheet3!E91,IF($A$15=$A$6,Sheet3!E131,IF($A$15=$A$7,Sheet3!E171,IF($A$15=$A$8,Sheet3!E211,IF($A$15=$A$9,Sheet3!E251,\"XX\")))))))","v":"XX"},{"$f":"IF($A$15=$A$3,Sheet3!F12,IF($A$15=$A$4,Sheet3!F51,IF($A$15=$A$5,Sheet3!F91,IF($A$15=$A$6,Sheet3!F131,IF($A$15=$A$7,Sheet3!F171,IF($A$15=$A$8,Sheet3!F211,IF($A$15=$A$9,Sheet3!F251,\"XX\")))))))","v":"XX"},{"$f":"IF($A$15=$A$3,Sheet3!G12,IF($A$15=$A$4,Sheet3!G51,IF($A$15=$A$5,Sheet3!G91,IF($A$15=$A$6,Sheet3!G131,IF($A$15=$A$7,Sheet3!G171,IF($A$15=$A$8,Sheet3!G211,IF($A$15=$A$9,Sheet3!G251,\"XX\")))))))","v":"XX"},{"$f":"IF($A$15=$A$3,Sheet3!H12,IF($A$15=$A$4,Sheet3!H51,IF($A$15=$A$5,Sheet3!H91,IF($A$15=$A$6,Sheet3!H131,IF($A$15=$A$7,Sheet3!H171,IF($A$15=$A$8,Sheet3!H211,IF($A$15=$A$9,Sheet3!H251,\"XX\")))))))","v":"XX"},{"$f":"IF($A$15=$A$3,Sheet3!I12,IF($A$15=$A$4,Sheet3!I51,IF($A$15=$A$5,Sheet3!I91,IF($A$15=$A$6,Sheet3!I131,IF($A$15=$A$7,Sheet3!I171,IF($A$15=$A$8,Sheet3!I211,IF($A$15=$A$9,Sheet3!I251,\"XX\")))))))","v":"XX"},{"$f":"IF($A$15=$A$3,Sheet3!J12,IF($A$15=$A$4,Sheet3!J51,IF($A$15=$A$5,Sheet3!J91,IF($A$15=$A$6,Sheet3!J131,IF($A$15=$A$7,Sheet3!J171,IF($A$15=$A$8,Sheet3!J211,IF($A$15=$A$9,Sheet3!J251,\"XX\")))))))","v":"XX"},{"$f":"IF($A$15=$A$3,Sheet3!K12,IF($A$15=$A$4,Sheet3!K51,IF($A$15=$A$5,Sheet3!K91,IF($A$15=$A$6,Sheet3!K131,IF($A$15=$A$7,Sheet3!K171,IF($A$15=$A$8,Sheet3!K211,IF($A$15=$A$9,Sheet3!K251,\"XX\")))))))","v":"XX"},{"$f":"IF($A$15=$A$3,Sheet3!L12,IF($A$15=$A$4,Sheet3!L51,IF($A$15=$A$5,Sheet3!L91,IF($A$15=$A$6,Sheet3!L131,IF($A$15=$A$7,Sheet3!L171,IF($A$15=$A$8,Sheet3!L211,IF($A$15=$A$9,Sheet3!L251,\"XX\")))))))","v":"XX"},{"$f":"IF($A$15=$A$3,Sheet3!M12,IF($A$15=$A$4,Sheet3!M51,IF($A$15=$A$5,Sheet3!M91,IF($A$15=$A$6,Sheet3!M131,IF($A$15=$A$7,Sheet3!M171,IF($A$15=$A$8,Sheet3!M211,IF($A$15=$A$9,Sheet3!M251,\"XX\")))))))","v":"XX"},{"$f":"IF($A$15=$A$3,Sheet3!N12,IF($A$15=$A$4,Sheet3!N51,IF($A$15=$A$5,Sheet3!N91,IF($A$15=$A$6,Sheet3!N131,IF($A$15=$A$7,Sheet3!N171,IF($A$15=$A$8,Sheet3!N211,IF($A$15=$A$9,Sheet3!N251,\"XX\")))))))","v":"XX"},{"$f":"IF($A$15=$A$3,Sheet3!O12,IF($A$15=$A$4,Sheet3!O51,IF($A$15=$A$5,Sheet3!O91,IF($A$15=$A$6,Sheet3!O131,IF($A$15=$A$7,Sheet3!O171,IF($A$15=$A$8,Sheet3!O211,IF($A$15=$A$9,Sheet3!O251,\"XX\")))))))","v":"XX"}]
[null,null,{"$f":"B33","v":"XX"},{"$f":"IF($A$15=$A$3,Sheet3!B13,IF($A$15=$A$4,Sheet3!B52,IF($A$15=$A$5,Sheet3!B92,IF($A$15=$A$6,Sheet3!B132,IF($A$15=$A$7,Sheet3!B172,IF($A$15=$A$8,Sheet3!B212,IF($A$15=$A$9,Sheet3!B252,\"XX\")))))))","v":"XX"},{"$f":"IF($A$15=$A$3,Sheet3!C13,IF($A$15=$A$4,Sheet3!C52,IF($A$15=$A$5,Sheet3!C92,IF($A$15=$A$6,Sheet3!C132,IF($A$15=$A$7,Sheet3!C172,IF($A$15=$A$8,Sheet3!C212,IF($A$15=$A$9,Sheet3!C252,\"XX\")))))))","v":"XX"},{"$f":"IF($A$15=$A$3,Sheet3!D13,IF($A$15=$A$4,Sheet3!D52,IF($A$15=$A$5,Sheet3!D92,IF($A$15=$A$6,Sheet3!D132,IF($A$15=$A$7,Sheet3!D172,IF($A$15=$A$8,Sheet3!D212,IF($A$15=$A$9,Sheet3!D252,\"XX\")))))))","v":"XX"},{"$f":"IF($A$15=$A$3,Sheet3!E13,IF($A$15=$A$4,Sheet3!E52,IF($A$15=$A$5,Sheet3!E92,IF($A$15=$A$6,Sheet3!E132,IF($A$15=$A$7,Sheet3!E172,IF($A$15=$A$8,Sheet3!E212,IF($A$15=$A$9,Sheet3!E252,\"XX\")))))))","v":"XX"},{"$f":"IF($A$15=$A$3,Sheet3!F13,IF($A$15=$A$4,Sheet3!F52,IF($A$15=$A$5,Sheet3!F92,IF($A$15=$A$6,Sheet3!F132,IF($A$15=$A$7,Sheet3!F172,IF($A$15=$A$8,Sheet3!F212,IF($A$15=$A$9,Sheet3!F252,\"XX\")))))))","v":"XX"},{"$f":"IF($A$15=$A$3,Sheet3!G13,IF($A$15=$A$4,Sheet3!G52,IF($A$15=$A$5,Sheet3!G92,IF($A$15=$A$6,Sheet3!G132,IF($A$15=$A$7,Sheet3!G172,IF($A$15=$A$8,Sheet3!G212,IF($A$15=$A$9,Sheet3!G252,\"XX\")))))))","v":"XX"},{"$f":"IF($A$15=$A$3,Sheet3!H13,IF($A$15=$A$4,Sheet3!H52,IF($A$15=$A$5,Sheet3!H92,IF($A$15=$A$6,Sheet3!H132,IF($A$15=$A$7,Sheet3!H172,IF($A$15=$A$8,Sheet3!H212,IF($A$15=$A$9,Sheet3!H252,\"XX\")))))))","v":"XX"},{"$f":"IF($A$15=$A$3,Sheet3!I13,IF($A$15=$A$4,Sheet3!I52,IF($A$15=$A$5,Sheet3!I92,IF($A$15=$A$6,Sheet3!I132,IF($A$15=$A$7,Sheet3!I172,IF($A$15=$A$8,Sheet3!I212,IF($A$15=$A$9,Sheet3!I252,\"XX\")))))))","v":"XX"},{"$f":"IF($A$15=$A$3,Sheet3!J13,IF($A$15=$A$4,Sheet3!J52,IF($A$15=$A$5,Sheet3!J92,IF($A$15=$A$6,Sheet3!J132,IF($A$15=$A$7,Sheet3!J172,IF($A$15=$A$8,Sheet3!J212,IF($A$15=$A$9,Sheet3!J252,\"XX\")))))))","v":"XX"},{"$f":"IF($A$15=$A$3,Sheet3!K13,IF($A$15=$A$4,Sheet3!K52,IF($A$15=$A$5,Sheet3!K92,IF($A$15=$A$6,Sheet3!K132,IF($A$15=$A$7,Sheet3!K172,IF($A$15=$A$8,Sheet3!K212,IF($A$15=$A$9,Sheet3!K252,\"XX\")))))))","v":"XX"},{"$f":"IF($A$15=$A$3,Sheet3!L13,IF($A$15=$A$4,Sheet3!L52,IF($A$15=$A$5,Sheet3!L92,IF($A$15=$A$6,Sheet3!L132,IF($A$15=$A$7,Sheet3!L172,IF($A$15=$A$8,Sheet3!L212,IF($A$15=$A$9,Sheet3!L252,\"XX\")))))))","v":"XX"},{"$f":"IF($A$15=$A$3,Sheet3!M13,IF($A$15=$A$4,Sheet3!M52,IF($A$15=$A$5,Sheet3!M92,IF($A$15=$A$6,Sheet3!M132,IF($A$15=$A$7,Sheet3!M172,IF($A$15=$A$8,Sheet3!M212,IF($A$15=$A$9,Sheet3!M252,\"XX\")))))))","v":"XX"},{"$f":"IF($A$15=$A$3,Sheet3!N13,IF($A$15=$A$4,Sheet3!N52,IF($A$15=$A$5,Sheet3!N92,IF($A$15=$A$6,Sheet3!N132,IF($A$15=$A$7,Sheet3!N172,IF($A$15=$A$8,Sheet3!N212,IF($A$15=$A$9,Sheet3!N252,\"XX\")))))))","v":"XX"},{"$f":"IF($A$15=$A$3,Sheet3!O13,IF($A$15=$A$4,Sheet3!O52,IF($A$15=$A$5,Sheet3!O92,IF($A$15=$A$6,Sheet3!O132,IF($A$15=$A$7,Sheet3!O172,IF($A$15=$A$8,Sheet3!O212,IF($A$15=$A$9,Sheet3!O252,\"XX\")))))))","v":"XX"}]
[{"$f":"IF($A$15=$A$3,Sheet3!A15,IF($A$15=$A$4,Sheet3!A54,IF($A$15=$A$5,Sheet3!A94,IF($A$15=$A$6,Sheet3!A134,IF($A$15=$A$7,Sheet3!A174,IF($A$15=$A$8,Sheet3!A214,IF($A$15=$A$9,Sheet3!A254,\"XX\")))))))","v":"XX"},null,null,{"$f":"IF($A$15=$A$3,Sheet3!B14,IF($A$15=$A$4,Sheet3!B53,IF($A$15=$A$5,Sheet3!B93,IF($A$15=$A$6,Sheet3!B133,IF($A$15=$A$7,Sheet3!B173,IF($A$15=$A$8,Sheet3!B213,IF($A$15=$A$9,Sheet3!B253,\"XX\")))))))","v":"XX"},{"$f":"IF($A$15=$A$3,Sheet3!C14,IF($A$15=$A$4,Sheet3!C53,IF($A$15=$A$5,Sheet3!C93,IF($A$15=$A$6,Sheet3!C133,IF($A$15=$A$7,Sheet3!C173,IF($A$15=$A$8,Sheet3!C213,IF($A$15=$A$9,Sheet3!C253,\"XX\")))))))","v":"XX"},{"$f":"IF($A$15=$A$3,Sheet3!D14,IF($A$15=$A$4,Sheet3!D53,IF($A$15=$A$5,Sheet3!D93,IF($A$15=$A$6,Sheet3!D133,IF($A$15=$A$7,Sheet3!D173,IF($A$15=$A$8,Sheet3!D213,IF($A$15=$A$9,Sheet3!D253,\"XX\")))))))","v":"XX"},{"$f":"IF($A$15=$A$3,Sheet3!E14,IF($A$15=$A$4,Sheet3!E53,IF($A$15=$A$5,Sheet3!E93,IF($A$15=$A$6,Sheet3!E133,IF($A$15=$A$7,Sheet3!E173,IF($A$15=$A$8,Sheet3!E213,IF($A$15=$A$9,Sheet3!E253,\"XX\")))))))","v":"XX"},{"$f":"IF($A$15=$A$3,Sheet3!F14,IF($A$15=$A$4,Sheet3!F53,IF($A$15=$A$5,Sheet3!F93,IF($A$15=$A$6,Sheet3!F133,IF($A$15=$A$7,Sheet3!F173,IF($A$15=$A$8,Sheet3!F213,IF($A$15=$A$9,Sheet3!F253,\"XX\")))))))","v":"XX"},{"$f":"IF($A$15=$A$3,Sheet3!G14,IF($A$15=$A$4,Sheet3!G53,IF($A$15=$A$5,Sheet3!G93,IF($A$15=$A$6,Sheet3!G133,IF($A$15=$A$7,Sheet3!G173,IF($A$15=$A$8,Sheet3!G213,IF($A$15=$A$9,Sheet3!G253,\"XX\")))))))","v":"XX"},{"$f":"IF($A$15=$A$3,Sheet3!H14,IF($A$15=$A$4,Sheet3!H53,IF($A$15=$A$5,Sheet3!H93,IF($A$15=$A$6,Sheet3!H133,IF($A$15=$A$7,Sheet3!H173,IF($A$15=$A$8,Sheet3!H213,IF($A$15=$A$9,Sheet3!H253,\"XX\")))))))","v":"XX"},{"$f":"IF($A$15=$A$3,Sheet3!I14,IF($A$15=$A$4,Sheet3!I53,IF($A$15=$A$5,Sheet3!I93,IF($A$15=$A$6,Sheet3!I133,IF($A$15=$A$7,Sheet3!I173,IF($A$15=$A$8,Sheet3!I213,IF($A$15=$A$9,Sheet3!I253,\"XX\")))))))","v":"XX"},{"$f":"IF($A$15=$A$3,Sheet3!J14,IF($A$15=$A$4,Sheet3!J53,IF($A$15=$A$5,Sheet3!J93,IF($A$15=$A$6,Sheet3!J133,IF($A$15=$A$7,Sheet3!J173,IF($A$15=$A$8,Sheet3!J213,IF($A$15=$A$9,Sheet3!J253,\"XX\")))))))","v":"XX"},{"$f":"IF($A$15=$A$3,Sheet3!K14,IF($A$15=$A$4,Sheet3!K53,IF($A$15=$A$5,Sheet3!K93,IF($A$15=$A$6,Sheet3!K133,IF($A$15=$A$7,Sheet3!K173,IF($A$15=$A$8,Sheet3!K213,IF($A$15=$A$9,Sheet3!K253,\"XX\")))))))","v":"XX"},{"$f":"IF($A$15=$A$3,Sheet3!L14,IF($A$15=$A$4,Sheet3!L53,IF($A$15=$A$5,Sheet3!L93,IF($A$15=$A$6,Sheet3!L133,IF($A$15=$A$7,Sheet3!L173,IF($A$15=$A$8,Sheet3!L213,IF($A$15=$A$9,Sheet3!L253,\"XX\")))))))","v":"XX"},{"$f":"IF($A$15=$A$3,Sheet3!M14,IF($A$15=$A$4,Sheet3!M53,IF($A$15=$A$5,Sheet3!M93,IF($A$15=$A$6,Sheet3!M133,IF($A$15=$A$7,Sheet3!M173,IF($A$15=$A$8,Sheet3!M213,IF($A$15=$A$9,Sheet3!M253,\"XX\")))))))","v":"XX"},{"$f":"IF($A$15=$A$3,Sheet3!N14,IF($A$15=$A$4,Sheet3!N53,IF($A$15=$A$5,Sheet3!N93,IF($A$15=$A$6,Sheet3!N133,IF($A$15=$A$7,Sheet3!N173,IF($A$15=$A$8,Sheet3!N213,IF($A$15=$A$9,Sheet3!N253,\"XX\")))))))","v":"XX"},{"$f":"IF($A$15=$A$3,Sheet3!O14,IF($A$15=$A$4,Sheet3!O53,IF($A$15=$A$5,Sheet3!O93,IF($A$15=$A$6,Sheet3!O133,IF($A$15=$A$7,Sheet3!O173,IF($A$15=$A$8,Sheet3!O213,IF($A$15=$A$9,Sheet3!O253,\"XX\")))))))","v":"XX"}]
[null,{"$f":"A35","v":"XX"},null,{"$f":"IF($A$15=$A$3,Sheet3!B15,IF($A$15=$A$4,Sheet3!B54,IF($A$15=$A$5,Sheet3!B94,IF($A$15=$A$6,Sheet3!B134,IF($A$15=$A$7,Sheet3!B174,IF($A$15=$A$8,Sheet3!B214,IF($A$15=$A$9,Sheet3!B254,\"XX\")))))))","v":"XX"},{"$f":"IF($A$15=$A$3,Sheet3!C15,IF($A$15=$A$4,Sheet3!C54,IF($A$15=$A$5,Sheet3!C94,IF($A$15=$A$6,Sheet3!C134,IF($A$15=$A$7,Sheet3!C174,IF($A$15=$A$8,Sheet3!C214,IF($A$15=$A$9,Sheet3!C254,\"XX\")))))))","v":"XX"},{"$f":"IF($A$15=$A$3,Sheet3!D15,IF($A$15=$A$4,Sheet3!D54,IF($A$15=$A$5,Sheet3!D94,IF($A$15=$A$6,Sheet3!D134,IF($A$15=$A$7,Sheet3!D174,IF($A$15=$A$8,Sheet3!D214,IF($A$15=$A$9,Sheet3!D254,\"XX\")))))))","v":"XX"},{"$f":"IF($A$15=$A$3,Sheet3!E15,IF($A$15=$A$4,Sheet3!E54,IF($A$15=$A$5,Sheet3!E94,IF($A$15=$A$6,Sheet3!E134,IF($A$15=$A$7,Sheet3!E174,IF($A$15=$A$8,Sheet3!E214,IF($A$15=$A$9,Sheet3!E254,\"XX\")))))))","v":"XX"},{"$f":"IF($A$15=$A$3,Sheet3!F15,IF($A$15=$A$4,Sheet3!F54,IF($A$15=$A$5,Sheet3!F94,IF($A$15=$A$6,Sheet3!F134,IF($A$15=$A$7,Sheet3!F174,IF($A$15=$A$8,Sheet3!F214,IF($A$15=$A$9,Sheet3!F254,\"XX\")))))))","v":"XX"},{"$f":"IF($A$15=$A$3,Sheet3!G15,IF($A$15=$A$4,Sheet3!G54,IF($A$15=$A$5,Sheet3!G94,IF($A$15=$A$6,Sheet3!G134,IF($A$15=$A$7,Sheet3!G174,IF($A$15=$A$8,Sheet3!G214,IF($A$15=$A$9,Sheet3!G254,\"XX\")))))))","v":"XX"},{"$f":"IF($A$15=$A$3,Sheet3!H15,IF($A$15=$A$4,Sheet3!H54,IF($A$15=$A$5,Sheet3!H94,IF($A$15=$A$6,Sheet3!H134,IF($A$15=$A$7,Sheet3!H174,IF($A$15=$A$8,Sheet3!H214,IF($A$15=$A$9,Sheet3!H254,\"XX\")))))))","v":"XX"},{"$f":"IF($A$15=$A$3,Sheet3!I15,IF($A$15=$A$4,Sheet3!I54,IF($A$15=$A$5,Sheet3!I94,IF($A$15=$A$6,Sheet3!I134,IF($A$15=$A$7,Sheet3!I174,IF($A$15=$A$8,Sheet3!I214,IF($A$15=$A$9,Sheet3!I254,\"XX\")))))))","v":"XX"},{"$f":"IF($A$15=$A$3,Sheet3!J15,IF($A$15=$A$4,Sheet3!J54,IF($A$15=$A$5,Sheet3!J94,IF($A$15=$A$6,Sheet3!J134,IF($A$15=$A$7,Sheet3!J174,IF($A$15=$A$8,Sheet3!J214,IF($A$15=$A$9,Sheet3!J254,\"XX\")))))))","v":"XX"},{"$f":"IF($A$15=$A$3,Sheet3!K15,IF($A$15=$A$4,Sheet3!K54,IF($A$15=$A$5,Sheet3!K94,IF($A$15=$A$6,Sheet3!K134,IF($A$15=$A$7,Sheet3!K174,IF($A$15=$A$8,Sheet3!K214,IF($A$15=$A$9,Sheet3!K254,\"XX\")))))))","v":"XX"},{"$f":"IF($A$15=$A$3,Sheet3!L15,IF($A$15=$A$4,Sheet3!L54,IF($A$15=$A$5,Sheet3!L94,IF($A$15=$A$6,Sheet3!L134,IF($A$15=$A$7,Sheet3!L174,IF($A$15=$A$8,Sheet3!L214,IF($A$15=$A$9,Sheet3!L254,\"XX\")))))))","v":"XX"},{"$f":"IF($A$15=$A$3,Sheet3!M15,IF($A$15=$A$4,Sheet3!M54,IF($A$15=$A$5,Sheet3!M94,IF($A$15=$A$6,Sheet3!M134,IF($A$15=$A$7,Sheet3!M174,IF($A$15=$A$8,Sheet3!M214,IF($A$15=$A$9,Sheet3!M254,\"XX\")))))))","v":"XX"},{"$f":"IF($A$15=$A$3,Sheet3!N15,IF($A$15=$A$4,Sheet3!N54,IF($A$15=$A$5,Sheet3!N94,IF($A$15=$A$6,Sheet3!N134,IF($A$15=$A$7,Sheet3!N174,IF($A$15=$A$8,Sheet3!N214,IF($A$15=$A$9,Sheet3!N254,\"XX\")))))))","v":"XX"},{"$f":"IF($A$15=$A$3,Sheet3!O15,IF($A$15=$A$4,Sheet3!O54,IF($A$15=$A$5,Sheet3!O94,IF($A$15=$A$6,Sheet3!O134,IF($A$15=$A$7,Sheet3!O174,IF($A$15=$A$8,Sheet3!O214,IF($A$15=$A$9,Sheet3!O254,\"XX\")))))))","v":"XX"}]
[null,null,{"$f":"B36","v":"XX"},{"$f":"IF($A$15=$A$3,Sheet3!B16,IF($A$15=$A$4,Sheet3!B55,IF($A$15=$A$5,Sheet3!B95,IF($A$15=$A$6,Sheet3!B135,IF($A$15=$A$7,Sheet3!B175,IF($A$15=$A$8,Sheet3!B215,IF($A$15=$A$9,Sheet3!B255,\"XX\")))))))","v":"XX"},{"$f":"IF($A$15=$A$3,Sheet3!C16,IF($A$15=$A$4,Sheet3!C55,IF($A$15=$A$5,Sheet3!C95,IF($A$15=$A$6,Sheet3!C135,IF($A$15=$A$7,Sheet3!C175,IF($A$15=$A$8,Sheet3!C215,IF($A$15=$A$9,Sheet3!C255,\"XX\")))))))","v":"XX"},{"$f":"IF($A$15=$A$3,Sheet3!D16,IF($A$15=$A$4,Sheet3!D55,IF($A$15=$A$5,Sheet3!D95,IF($A$15=$A$6,Sheet3!D135,IF($A$15=$A$7,Sheet3!D175,IF($A$15=$A$8,Sheet3!D215,IF($A$15=$A$9,Sheet3!D255,\"XX\")))))))","v":"XX"},{"$f":"IF($A$15=$A$3,Sheet3!E16,IF($A$15=$A$4,Sheet3!E55,IF($A$15=$A$5,Sheet3!E95,IF($A$15=$A$6,Sheet3!E135,IF($A$15=$A$7,Sheet3!E175,IF($A$15=$A$8,Sheet3!E215,IF($A$15=$A$9,Sheet3!E255,\"XX\")))))))","v":"XX"},{"$f":"IF($A$15=$A$3,Sheet3!F16,IF($A$15=$A$4,Sheet3!F55,IF($A$15=$A$5,Sheet3!F95,IF($A$15=$A$6,Sheet3!F135,IF($A$15=$A$7,Sheet3!F175,IF($A$15=$A$8,Sheet3!F215,IF($A$15=$A$9,Sheet3!F255,\"XX\")))))))","v":"XX"},{"$f":"IF($A$15=$A$3,Sheet3!G16,IF($A$15=$A$4,Sheet3!G55,IF($A$15=$A$5,Sheet3!G95,IF($A$15=$A$6,Sheet3!G135,IF($A$15=$A$7,Sheet3!G175,IF($A$15=$A$8,Sheet3!G215,IF($A$15=$A$9,Sheet3!G255,\"XX\")))))))","v":"XX"},{"$f":"IF($A$15=$A$3,Sheet3!H16,IF($A$15=$A$4,Sheet3!H55,IF($A$15=$A$5,Sheet3!H95,IF($A$15=$A$6,Sheet3!H135,IF($A$15=$A$7,Sheet3!H175,IF($A$15=$A$8,Sheet3!H215,IF($A$15=$A$9,Sheet3!H255,\"XX\")))))))","v":"XX"},{"$f":"IF($A$15=$A$3,Sheet3!I16,IF($A$15=$A$4,Sheet3!I55,IF($A$15=$A$5,Sheet3!I95,IF($A$15=$A$6,Sheet3!I135,IF($A$15=$A$7,Sheet3!I175,IF($A$15=$A$8,Sheet3!I215,IF($A$15=$A$9,Sheet3!I255,\"XX\")))))))","v":"XX"},{"$f":"IF($A$15=$A$3,Sheet3!J16,IF($A$15=$A$4,Sheet3!J55,IF($A$15=$A$5,Sheet3!J95,IF($A$15=$A$6,Sheet3!J135,IF($A$15=$A$7,Sheet3!J175,IF($A$15=$A$8,Sheet3!J215,IF($A$15=$A$9,Sheet3!J255,\"XX\")))))))","v":"XX"},{"$f":"IF($A$15=$A$3,Sheet3!K16,IF($A$15=$A$4,Sheet3!K55,IF($A$15=$A$5,Sheet3!K95,IF($A$15=$A$6,Sheet3!K135,IF($A$15=$A$7,Sheet3!K175,IF($A$15=$A$8,Sheet3!K215,IF($A$15=$A$9,Sheet3!K255,\"XX\")))))))","v":"XX"},{"$f":"IF($A$15=$A$3,Sheet3!L16,IF($A$15=$A$4,Sheet3!L55,IF($A$15=$A$5,Sheet3!L95,IF($A$15=$A$6,Sheet3!L135,IF($A$15=$A$7,Sheet3!L175,IF($A$15=$A$8,Sheet3!L215,IF($A$15=$A$9,Sheet3!L255,\"XX\")))))))","v":"XX"},{"$f":"IF($A$15=$A$3,Sheet3!M16,IF($A$15=$A$4,Sheet3!M55,IF($A$15=$A$5,Sheet3!M95,IF($A$15=$A$6,Sheet3!M135,IF($A$15=$A$7,Sheet3!M175,IF($A$15=$A$8,Sheet3!M215,IF($A$15=$A$9,Sheet3!M255,\"XX\")))))))","v":"XX"},{"$f":"IF($A$15=$A$3,Sheet3!N16,IF($A$15=$A$4,Sheet3!N55,IF($A$15=$A$5,Sheet3!N95,IF($A$15=$A$6,Sheet3!N135,IF($A$15=$A$7,Sheet3!N175,IF($A$15=$A$8,Sheet3!N215,IF($A$15=$A$9,Sheet3!N255,\"XX\")))))))","v":"XX"},{"$f":"IF($A$15=$A$3,Sheet3!O16,IF($A$15=$A$4,Sheet3!O55,IF($A$15=$A$5,Sheet3!O95,IF($A$15=$A$6,Sheet3!O135,IF($A$15=$A$7,Sheet3!O175,IF($A$15=$A$8,Sheet3!O215,IF($A$15=$A$9,Sheet3!O255,\"XX\")))))))","v":"XX"}]
[{"$f":"IF($A$15=$A$3,Sheet3!A18,IF($A$15=$A$4,Sheet3!A57,IF($A$15=$A$5,Sheet3!A97,IF($A$15=$A$6,Sheet3!A137,IF($A$15=$A$7,Sheet3!A177,IF($A$15=$A$8,Sheet3!A217,IF($A$15=$A$9,Sheet3!A257,\"XX\")))))))","v":"XX"},null,null,{"$f":"IF($A$15=$A$3,Sheet3!B17,IF($A$15=$A$4,Sheet3!B56,IF($A$15=$A$5,Sheet3!B96,IF($A$15=$A$6,Sheet3!B136,IF($A$15=$A$7,Sheet3!B176,IF($A$15=$A$8,Sheet3!B216,IF($A$15=$A$9,Sheet3!B256,\"XX\")))))))","v":"XX"},{"$f":"IF($A$15=$A$3,Sheet3!C17,IF($A$15=$A$4,Sheet3!C56,IF($A$15=$A$5,Sheet3!C96,IF($A$15=$A$6,Sheet3!C136,IF($A$15=$A$7,Sheet3!C176,IF($A$15=$A$8,Sheet3!C216,IF($A$15=$A$9,Sheet3!C256,\"XX\")))))))","v":"XX"},{"$f":"IF($A$15=$A$3,Sheet3!D17,IF($A$15=$A$4,Sheet3!D56,IF($A$15=$A$5,Sheet3!D96,IF($A$15=$A$6,Sheet3!D136,IF($A$15=$A$7,Sheet3!D176,IF($A$15=$A$8,Sheet3!D216,IF($A$15=$A$9,Sheet3!D256,\"XX\")))))))","v":"XX"},{"$f":"IF($A$15=$A$3,Sheet3!E17,IF($A$15=$A$4,Sheet3!E56,IF($A$15=$A$5,Sheet3!E96,IF($A$15=$A$6,Sheet3!E136,IF($A$15=$A$7,Sheet3!E176,IF($A$15=$A$8,Sheet3!E216,IF($A$15=$A$9,Sheet3!E256,\"XX\")))))))","v":"XX"},{"$f":"IF($A$15=$A$3,Sheet3!F17,IF($A$15=$A$4,Sheet3!F56,IF($A$15=$A$5,Sheet3!F96,IF($A$15=$A$6,Sheet3!F136,IF($A$15=$A$7,Sheet3!F176,IF($A$15=$A$8,Sheet3!F216,IF($A$15=$A$9,Sheet3!F256,\"XX\")))))))","v":"XX"},{"$f":"IF($A$15=$A$3,Sheet3!G17,IF($A$15=$A$4,Sheet3!G56,IF($A$15=$A$5,Sheet3!G96,IF($A$15=$A$6,Sheet3!G136,IF($A$15=$A$7,Sheet3!G176,IF($A$15=$A$8,Sheet3!G216,IF($A$15=$A$9,Sheet3!G256,\"XX\")))))))","v":"XX"},{"$f":"IF($A$15=$A$3,Sheet3!H17,IF($A$15=$A$4,Sheet3!H56,IF($A$15=$A$5,Sheet3!H96,IF($A$15=$A$6,Sheet3!H136,IF($A$15=$A$7,Sheet3!H176,IF($A$15=$A$8,Sheet3!H216,IF($A$15=$A$9,Sheet3!H256,\"XX\")))))))","v":"XX"},{"$f":"IF($A$15=$A$3,Sheet3!I17,IF($A$15=$A$4,Sheet3!I56,IF($A$15=$A$5,Sheet3!I96,IF($A$15=$A$6,Sheet3!I136,IF($A$15=$A$7,Sheet3!I176,IF($A$15=$A$8,Sheet3!I216,IF($A$15=$A$9,Sheet3!I256,\"XX\")))))))","v":"XX"},{"$f":"IF($A$15=$A$3,Sheet3!J17,IF($A$15=$A$4,Sheet3!J56,IF($A$15=$A$5,Sheet3!J96,IF($A$15=$A$6,Sheet3!J136,IF($A$15=$A$7,Sheet3!J176,IF($A$15=$A$8,Sheet3!J216,IF($A$15=$A$9,Sheet3!J256,\"XX\")))))))","v":"XX"},{"$f":"IF($A$15=$A$3,Sheet3!K17,IF($A$15=$A$4,Sheet3!K56,IF($A$15=$A$5,Sheet3!K96,IF($A$15=$A$6,Sheet3!K136,IF($A$15=$A$7,Sheet3!K176,IF($A$15=$A$8,Sheet3!K216,IF($A$15=$A$9,Sheet3!K256,\"XX\")))))))","v":"XX"},{"$f":"IF($A$15=$A$3,Sheet3!L17,IF($A$15=$A$4,Sheet3!L56,IF($A$15=$A$5,Sheet3!L96,IF($A$15=$A$6,Sheet3!L136,IF($A$15=$A$7,Sheet3!L176,IF($A$15=$A$8,Sheet3!L216,IF($A$15=$A$9,Sheet3!L256,\"XX\")))))))","v":"XX"},{"$f":"IF($A$15=$A$3,Sheet3!M17,IF($A$15=$A$4,Sheet3!M56,IF($A$15=$A$5,Sheet3!M96,IF($A$15=$A$6,Sheet3!M136,IF($A$15=$A$7,Sheet3!M176,IF($A$15=$A$8,Sheet3!M216,IF($A$15=$A$9,Sheet3!M256,\"XX\")))))))","v":"XX"},{"$f":"IF($A$15=$A$3,Sheet3!N17,IF($A$15=$A$4,Sheet3!N56,IF($A$15=$A$5,Sheet3!N96,IF($A$15=$A$6,Sheet3!N136,IF($A$15=$A$7,Sheet3!N176,IF($A$15=$A$8,Sheet3!N216,IF($A$15=$A$9,Sheet3!N256,\"XX\")))))))","v":"XX"},{"$f":"IF($A$15=$A$3,Sheet3!O17,IF($A$15=$A$4,Sheet3!O56,IF($A$15=$A$5,Sheet3!O96,IF($A$15=$A$6,Sheet3!O136,IF($A$15=$A$7,Sheet3!O176,IF($A$15=$A$8,Sheet3!O216,IF($A$15=$A$9,Sheet3!O256,\"XX\")))))))","v":"XX"}]
[null,{"$f":"A38","v":"XX"},null,{"$f":"IF($A$15=$A$3,Sheet3!B18,IF($A$15=$A$4,Sheet3!B57,IF($A$15=$A$5,Sheet3!B97,IF($A$15=$A$6,Sheet3!B137,IF($A$15=$A$7,Sheet3!B177,IF($A$15=$A$8,Sheet3!B217,IF($A$15=$A$9,Sheet3!B257,\"XX\")))))))","v":"XX"},{"$f":"IF($A$15=$A$3,Sheet3!C18,IF($A$15=$A$4,Sheet3!C57,IF($A$15=$A$5,Sheet3!C97,IF($A$15=$A$6,Sheet3!C137,IF($A$15=$A$7,Sheet3!C177,IF($A$15=$A$8,Sheet3!C217,IF($A$15=$A$9,Sheet3!C257,\"XX\")))))))","v":"XX"},{"$f":"IF($A$15=$A$3,Sheet3!D18,IF($A$15=$A$4,Sheet3!D57,IF($A$15=$A$5,Sheet3!D97,IF($A$15=$A$6,Sheet3!D137,IF($A$15=$A$7,Sheet3!D177,IF($A$15=$A$8,Sheet3!D217,IF($A$15=$A$9,Sheet3!D257,\"XX\")))))))","v":"XX"},{"$f":"IF($A$15=$A$3,Sheet3!E18,IF($A$15=$A$4,Sheet3!E57,IF($A$15=$A$5,Sheet3!E97,IF($A$15=$A$6,Sheet3!E137,IF($A$15=$A$7,Sheet3!E177,IF($A$15=$A$8,Sheet3!E217,IF($A$15=$A$9,Sheet3!E257,\"XX\")))))))","v":"XX"},{"$f":"IF($A$15=$A$3,Sheet3!F18,IF($A$15=$A$4,Sheet3!F57,IF($A$15=$A$5,Sheet3!F97,IF($A$15=$A$6,Sheet3!F137,IF($A$15=$A$7,Sheet3!F177,IF($A$15=$A$8,Sheet3!F217,IF($A$15=$A$9,Sheet3!F257,\"XX\")))))))","v":"XX"},{"$f":"IF($A$15=$A$3,Sheet3!G18,IF($A$15=$A$4,Sheet3!G57,IF($A$15=$A$5,Sheet3!G97,IF($A$15=$A$6,Sheet3!G137,IF($A$15=$A$7,Sheet3!G177,IF($A$15=$A$8,Sheet3!G217,IF($A$15=$A$9,Sheet3!G257,\"XX\")))))))","v":"XX"},{"$f":"IF($A$15=$A$3,Sheet3!H18,IF($A$15=$A$4,Sheet3!H57,IF($A$15=$A$5,Sheet3!H97,IF($A$15=$A$6,Sheet3!H137,IF($A$15=$A$7,Sheet3!H177,IF($A$15=$A$8,Sheet3!H217,IF($A$15=$A$9,Sheet3!H257,\"XX\")))))))","v":"XX"},{"$f":"IF($A$15=$A$3,Sheet3!I18,IF($A$15=$A$4,Sheet3!I57,IF($A$15=$A$5,Sheet3!I97,IF($A$15=$A$6,Sheet3!I137,IF($A$15=$A$7,Sheet3!I177,IF($A$15=$A$8,Sheet3!I217,IF($A$15=$A$9,Sheet3!I257,\"XX\")))))))","v":"XX"},{"$f":"IF($A$15=$A$3,Sheet3!J18,IF($A$15=$A$4,Sheet3!J57,IF($A$15=$A$5,Sheet3!J97,IF($A$15=$A$6,Sheet3!J137,IF($A$15=$A$7,Sheet3!J177,IF($A$15=$A$8,Sheet3!J217,IF($A$15=$A$9,Sheet3!J257,\"XX\")))))))","v":"XX"},{"$f":"IF($A$15=$A$3,Sheet3!K18,IF($A$15=$A$4,Sheet3!K57,IF($A$15=$A$5,Sheet3!K97,IF($A$15=$A$6,Sheet3!K137,IF($A$15=$A$7,Sheet3!K177,IF($A$15=$A$8,Sheet3!K217,IF($A$15=$A$9,Sheet3!K257,\"XX\")))))))","v":"XX"},{"$f":"IF($A$15=$A$3,Sheet3!L18,IF($A$15=$A$4,Sheet3!L57,IF($A$15=$A$5,Sheet3!L97,IF($A$15=$A$6,Sheet3!L137,IF($A$15=$A$7,Sheet3!L177,IF($A$15=$A$8,Sheet3!L217,IF($A$15=$A$9,Sheet3!L257,\"XX\")))))))","v":"XX"},{"$f":"IF($A$15=$A$3,Sheet3!M18,IF($A$15=$A$4,Sheet3!M57,IF($A$15=$A$5,Sheet3!M97,IF($A$15=$A$6,Sheet3!M137,IF($A$15=$A$7,Sheet3!M177,IF($A$15=$A$8,Sheet3!M217,IF($A$15=$A$9,Sheet3!M257,\"XX\")))))))","v":"XX"},{"$f":"IF($A$15=$A$3,Sheet3!N18,IF($A$15=$A$4,Sheet3!N57,IF($A$15=$A$5,Sheet3!N97,IF($A$15=$A$6,Sheet3!N137,IF($A$15=$A$7,Sheet3!N177,IF($A$15=$A$8,Sheet3!N217,IF($A$15=$A$9,Sheet3!N257,\"XX\")))))))","v":"XX"},{"$f":"IF($A$15=$A$3,Sheet3!O18,IF($A$15=$A$4,Sheet3!O57,IF($A$15=$A$5,Sheet3!O97,IF($A$15=$A$6,Sheet3!O137,IF($A$15=$A$7,Sheet3!O177,IF($A$15=$A$8,Sheet3!O217,IF($A$15=$A$9,Sheet3!O257,\"XX\")))))))","v":"XX"}]
[null,null,{"$f":"B39","v":"XX"},{"$f":"IF($A$15=$A$3,Sheet3!B19,IF($A$15=$A$4,Sheet3!B58,IF($A$15=$A$5,Sheet3!B98,IF($A$15=$A$6,Sheet3!B138,IF($A$15=$A$7,Sheet3!B178,IF($A$15=$A$8,Sheet3!B218,IF($A$15=$A$9,Sheet3!B258,\"XX\")))))))","v":"XX"},{"$f":"IF($A$15=$A$3,Sheet3!C19,IF($A$15=$A$4,Sheet3!C58,IF($A$15=$A$5,Sheet3!C98,IF($A$15=$A$6,Sheet3!C138,IF($A$15=$A$7,Sheet3!C178,IF($A$15=$A$8,Sheet3!C218,IF($A$15=$A$9,Sheet3!C258,\"XX\")))))))","v":"XX"},{"$f":"IF($A$15=$A$3,Sheet3!D19,IF($A$15=$A$4,Sheet3!D58,IF($A$15=$A$5,Sheet3!D98,IF($A$15=$A$6,Sheet3!D138,IF($A$15=$A$7,Sheet3!D178,IF($A$15=$A$8,Sheet3!D218,IF($A$15=$A$9,Sheet3!D258,\"XX\")))))))","v":"XX"},{"$f":"IF($A$15=$A$3,Sheet3!E19,IF($A$15=$A$4,Sheet3!E58,IF($A$15=$A$5,Sheet3!E98,IF($A$15=$A$6,Sheet3!E138,IF($A$15=$A$7,Sheet3!E178,IF($A$15=$A$8,Sheet3!E218,IF($A$15=$A$9,Sheet3!E258,\"XX\")))))))","v":"XX"},{"$f":"IF($A$15=$A$3,Sheet3!F19,IF($A$15=$A$4,Sheet3!F58,IF($A$15=$A$5,Sheet3!F98,IF($A$15=$A$6,Sheet3!F138,IF($A$15=$A$7,Sheet3!F178,IF($A$15=$A$8,Sheet3!F218,IF($A$15=$A$9,Sheet3!F258,\"XX\")))))))","v":"XX"},{"$f":"IF($A$15=$A$3,Sheet3!G19,IF($A$15=$A$4,Sheet3!G58,IF($A$15=$A$5,Sheet3!G98,IF($A$15=$A$6,Sheet3!G138,IF($A$15=$A$7,Sheet3!G178,IF($A$15=$A$8,Sheet3!G218,IF($A$15=$A$9,Sheet3!G258,\"XX\")))))))","v":"XX"},{"$f":"IF($A$15=$A$3,Sheet3!H19,IF($A$15=$A$4,Sheet3!H58,IF($A$15=$A$5,Sheet3!H98,IF($A$15=$A$6,Sheet3!H138,IF($A$15=$A$7,Sheet3!H178,IF($A$15=$A$8,Sheet3!H218,IF($A$15=$A$9,Sheet3!H258,\"XX\")))))))","v":"XX"},{"$f":"IF($A$15=$A$3,Sheet3!I19,IF($A$15=$A$4,Sheet3!I58,IF($A$15=$A$5,Sheet3!I98,IF($A$15=$A$6,Sheet3!I138,IF($A$15=$A$7,Sheet3!I178,IF($A$15=$A$8,Sheet3!I218,IF($A$15=$A$9,Sheet3!I258,\"XX\")))))))","v":"XX"},{"$f":"IF($A$15=$A$3,Sheet3!J19,IF($A$15=$A$4,Sheet3!J58,IF($A$15=$A$5,Sheet3!J98,IF($A$15=$A$6,Sheet3!J138,IF($A$15=$A$7,Sheet3!J178,IF($A$15=$A$8,Sheet3!J218,IF($A$15=$A$9,Sheet3!J258,\"XX\")))))))","v":"XX"},{"$f":"IF($A$15=$A$3,Sheet3!K19,IF($A$15=$A$4,Sheet3!K58,IF($A$15=$A$5,Sheet3!K98,IF($A$15=$A$6,Sheet3!K138,IF($A$15=$A$7,Sheet3!K178,IF($A$15=$A$8,Sheet3!K218,IF($A$15=$A$9,Sheet3!K258,\"XX\")))))))","v":"XX"},{"$f":"IF($A$15=$A$3,Sheet3!L19,IF($A$15=$A$4,Sheet3!L58,IF($A$15=$A$5,Sheet3!L98,IF($A$15=$A$6,Sheet3!L138,IF($A$15=$A$7,Sheet3!L178,IF($A$15=$A$8,Sheet3!L218,IF($A$15=$A$9,Sheet3!L258,\"XX\")))))))","v":"XX"},{"$f":"IF($A$15=$A$3,Sheet3!M19,IF($A$15=$A$4,Sheet3!M58,IF($A$15=$A$5,Sheet3!M98,IF($A$15=$A$6,Sheet3!M138,IF($A$15=$A$7,Sheet3!M178,IF($A$15=$A$8,Sheet3!M218,IF($A$15=$A$9,Sheet3!M258,\"XX\")))))))","v":"XX"},{"$f":"IF($A$15=$A$3,Sheet3!N19,IF($A$15=$A$4,Sheet3!N58,IF($A$15=$A$5,Sheet3!N98,IF($A$15=$A$6,Sheet3!N138,IF($A$15=$A$7,Sheet3!N178,IF($A$15=$A$8,Sheet3!N218,IF($A$15=$A$9,Sheet3!N258,\"XX\")))))))","v":"XX"},{"$f":"IF($A$15=$A$3,Sheet3!O19,IF($A$15=$A$4,Sheet3!O58,IF($A$15=$A$5,Sheet3!O98,IF($A$15=$A$6,Sheet3!O138,IF($A$15=$A$7,Sheet3!O178,IF($A$15=$A$8,Sheet3!O218,IF($A$15=$A$9,Sheet3!O258,\"XX\")))))))","v":"XX"}]
[{"$f":"IF($A$15=$A$3,Sheet3!A21,IF($A$15=$A$4,Sheet3!A60,IF($A$15=$A$5,Sheet3!A100,IF($A$15=$A$6,Sheet3!A140,IF($A$15=$A$7,Sheet3!A180,IF($A$15=$A$8,Sheet3!A220,IF($A$15=$A$9,Sheet3!A260,\"XX\")))))))","v":"XX"},null,null,{"$f":"IF($A$15=$A$3,Sheet3!B20,IF($A$15=$A$4,Sheet3!B59,IF($A$15=$A$5,Sheet3!B99,IF($A$15=$A$6,Sheet3!B139,IF($A$15=$A$7,Sheet3!B179,IF($A$15=$A$8,Sheet3!B219,IF($A$15=$A$9,Sheet3!B259,\"XX\")))))))","v":"XX"},{"$f":"IF($A$15=$A$3,Sheet3!C20,IF($A$15=$A$4,Sheet3!C59,IF($A$15=$A$5,Sheet3!C99,IF($A$15=$A$6,Sheet3!C139,IF($A$15=$A$7,Sheet3!C179,IF($A$15=$A$8,Sheet3!C219,IF($A$15=$A$9,Sheet3!C259,\"XX\")))))))","v":"XX"},{"$f":"IF($A$15=$A$3,Sheet3!D20,IF($A$15=$A$4,Sheet3!D59,IF($A$15=$A$5,Sheet3!D99,IF($A$15=$A$6,Sheet3!D139,IF($A$15=$A$7,Sheet3!D179,IF($A$15=$A$8,Sheet3!D219,IF($A$15=$A$9,Sheet3!D259,\"XX\")))))))","v":"XX"},{"$f":"IF($A$15=$A$3,Sheet3!E20,IF($A$15=$A$4,Sheet3!E59,IF($A$15=$A$5,Sheet3!E99,IF($A$15=$A$6,Sheet3!E139,IF($A$15=$A$7,Sheet3!E179,IF($A$15=$A$8,Sheet3!E219,IF($A$15=$A$9,Sheet3!E259,\"XX\")))))))","v":"XX"},{"$f":"IF($A$15=$A$3,Sheet3!F20,IF($A$15=$A$4,Sheet3!F59,IF($A$15=$A$5,Sheet3!F99,IF($A$15=$A$6,Sheet3!F139,IF($A$15=$A$7,Sheet3!F179,IF($A$15=$A$8,Sheet3!F219,IF($A$15=$A$9,Sheet3!F259,\"XX\")))))))","v":"XX"},{"$f":"IF($A$15=$A$3,Sheet3!G20,IF($A$15=$A$4,Sheet3!G59,IF($A$15=$A$5,Sheet3!G99,IF($A$15=$A$6,Sheet3!G139,IF($A$15=$A$7,Sheet3!G179,IF($A$15=$A$8,Sheet3!G219,IF($A$15=$A$9,Sheet3!G259,\"XX\")))))))","v":"XX"},{"$f":"IF($A$15=$A$3,Sheet3!H20,IF($A$15=$A$4,Sheet3!H59,IF($A$15=$A$5,Sheet3!H99,IF($A$15=$A$6,Sheet3!H139,IF($A$15=$A$7,Sheet3!H179,IF($A$15=$A$8,Sheet3!H219,IF($A$15=$A$9,Sheet3!H259,\"XX\")))))))","v":"XX"},{"$f":"IF($A$15=$A$3,Sheet3!I20,IF($A$15=$A$4,Sheet3!I59,IF($A$15=$A$5,Sheet3!I99,IF($A$15=$A$6,Sheet3!I139,IF($A$15=$A$7,Sheet3!I179,IF($A$15=$A$8,Sheet3!I219,IF($A$15=$A$9,Sheet3!I259,\"XX\")))))))","v":"XX"},{"$f":"IF($A$15=$A$3,Sheet3!J20,IF($A$15=$A$4,Sheet3!J59,IF($A$15=$A$5,Sheet3!J99,IF($A$15=$A$6,Sheet3!J139,IF($A$15=$A$7,Sheet3!J179,IF($A$15=$A$8,Sheet3!J219,IF($A$15=$A$9,Sheet3!J259,\"XX\")))))))","v":"XX"},{"$f":"IF($A$15=$A$3,Sheet3!K20,IF($A$15=$A$4,Sheet3!K59,IF($A$15=$A$5,Sheet3!K99,IF($A$15=$A$6,Sheet3!K139,IF($A$15=$A$7,Sheet3!K179,IF($A$15=$A$8,Sheet3!K219,IF($A$15=$A$9,Sheet3!K259,\"XX\")))))))","v":"XX"},{"$f":"IF($A$15=$A$3,Sheet3!L20,IF($A$15=$A$4,Sheet3!L59,IF($A$15=$A$5,Sheet3!L99,IF($A$15=$A$6,Sheet3!L139,IF($A$15=$A$7,Sheet3!L179,IF($A$15=$A$8,Sheet3!L219,IF($A$15=$A$9,Sheet3!L259,\"XX\")))))))","v":"XX"},{"$f":"IF($A$15=$A$3,Sheet3!M20,IF($A$15=$A$4,Sheet3!M59,IF($A$15=$A$5,Sheet3!M99,IF($A$15=$A$6,Sheet3!M139,IF($A$15=$A$7,Sheet3!M179,IF($A$15=$A$8,Sheet3!M219,IF($A$15=$A$9,Sheet3!M259,\"XX\")))))))","v":"XX"},{"$f":"IF($A$15=$A$3,Sheet3!N20,IF($A$15=$A$4,Sheet3!N59,IF($A$15=$A$5,Sheet3!N99,IF($A$15=$A$6,Sheet3!N139,IF($A$15=$A$7,Sheet3!N179,IF($A$15=$A$8,Sheet3!N219,IF($A$15=$A$9,Sheet3!N259,\"XX\")))))))","v":"XX"},{"$f":"IF($A$15=$A$3,Sheet3!O20,IF($A$15=$A$4,Sheet3!O59,IF($A$15=$A$5,Sheet3!O99,IF($A$15=$A$6,Sheet3!O139,IF($A$15=$A$7,Sheet3!O179,IF($A$15=$A$8,Sheet3!O219,IF($A$15=$A$9,Sheet3!O259,\"XX\")))))))","v":"XX"}]
[null,{"$f":"A41","v":"XX"},null,{"$f":"IF($A$15=$A$3,Sheet3!B21,IF($A$15=$A$4,Sheet3!B60,IF($A$15=$A$5,Sheet3!B100,IF($A$15=$A$6,Sheet3!B140,IF($A$15=$A$7,Sheet3!B180,IF($A$15=$A$8,Sheet3!B220,IF($A$15=$A$9,Sheet3!B260,\"XX\")))))))","v":"XX"},{"$f":"IF($A$15=$A$3,Sheet3!C21,IF($A$15=$A$4,Sheet3!C60,IF($A$15=$A$5,Sheet3!C100,IF($A$15=$A$6,Sheet3!C140,IF($A$15=$A$7,Sheet3!C180,IF($A$15=$A$8,Sheet3!C220,IF($A$15=$A$9,Sheet3!C260,\"XX\")))))))","v":"XX"},{"$f":"IF($A$15=$A$3,Sheet3!D21,IF($A$15=$A$4,Sheet3!D60,IF($A$15=$A$5,Sheet3!D100,IF($A$15=$A$6,Sheet3!D140,IF($A$15=$A$7,Sheet3!D180,IF($A$15=$A$8,Sheet3!D220,IF($A$15=$A$9,Sheet3!D260,\"XX\")))))))","v":"XX"},{"$f":"IF($A$15=$A$3,Sheet3!E21,IF($A$15=$A$4,Sheet3!E60,IF($A$15=$A$5,Sheet3!E100,IF($A$15=$A$6,Sheet3!E140,IF($A$15=$A$7,Sheet3!E180,IF($A$15=$A$8,Sheet3!E220,IF($A$15=$A$9,Sheet3!E260,\"XX\")))))))","v":"XX"},{"$f":"IF($A$15=$A$3,Sheet3!F21,IF($A$15=$A$4,Sheet3!F60,IF($A$15=$A$5,Sheet3!F100,IF($A$15=$A$6,Sheet3!F140,IF($A$15=$A$7,Sheet3!F180,IF($A$15=$A$8,Sheet3!F220,IF($A$15=$A$9,Sheet3!F260,\"XX\")))))))","v":"XX"},{"$f":"IF($A$15=$A$3,Sheet3!G21,IF($A$15=$A$4,Sheet3!G60,IF($A$15=$A$5,Sheet3!G100,IF($A$15=$A$6,Sheet3!G140,IF($A$15=$A$7,Sheet3!G180,IF($A$15=$A$8,Sheet3!G220,IF($A$15=$A$9,Sheet3!G260,\"XX\")))))))","v":"XX"},{"$f":"IF($A$15=$A$3,Sheet3!H21,IF($A$15=$A$4,Sheet3!H60,IF($A$15=$A$5,Sheet3!H100,IF($A$15=$A$6,Sheet3!H140,IF($A$15=$A$7,Sheet3!H180,IF($A$15=$A$8,Sheet3!H220,IF($A$15=$A$9,Sheet3!H260,\"XX\")))))))","v":"XX"},{"$f":"IF($A$15=$A$3,Sheet3!I21,IF($A$15=$A$4,Sheet3!I60,IF($A$15=$A$5,Sheet3!I100,IF($A$15=$A$6,Sheet3!I140,IF($A$15=$A$7,Sheet3!I180,IF($A$15=$A$8,Sheet3!I220,IF($A$15=$A$9,Sheet3!I260,\"XX\")))))))","v":"XX"},{"$f":"IF($A$15=$A$3,Sheet3!J21,IF($A$15=$A$4,Sheet3!J60,IF($A$15=$A$5,Sheet3!J100,IF($A$15=$A$6,Sheet3!J140,IF($A$15=$A$7,Sheet3!J180,IF($A$15=$A$8,Sheet3!J220,IF($A$15=$A$9,Sheet3!J260,\"XX\")))))))","v":"XX"},{"$f":"IF($A$15=$A$3,Sheet3!K21,IF($A$15=$A$4,Sheet3!K60,IF($A$15=$A$5,Sheet3!K100,IF($A$15=$A$6,Sheet3!K140,IF($A$15=$A$7,Sheet3!K180,IF($A$15=$A$8,Sheet3!K220,IF($A$15=$A$9,Sheet3!K260,\"XX\")))))))","v":"XX"},{"$f":"IF($A$15=$A$3,Sheet3!L21,IF($A$15=$A$4,Sheet3!L60,IF($A$15=$A$5,Sheet3!L100,IF($A$15=$A$6,Sheet3!L140,IF($A$15=$A$7,Sheet3!L180,IF($A$15=$A$8,Sheet3!L220,IF($A$15=$A$9,Sheet3!L260,\"XX\")))))))","v":"XX"},{"$f":"IF($A$15=$A$3,Sheet3!M21,IF($A$15=$A$4,Sheet3!M60,IF($A$15=$A$5,Sheet3!M100,IF($A$15=$A$6,Sheet3!M140,IF($A$15=$A$7,Sheet3!M180,IF($A$15=$A$8,Sheet3!M220,IF($A$15=$A$9,Sheet3!M260,\"XX\")))))))","v":"XX"},{"$f":"IF($A$15=$A$3,Sheet3!N21,IF($A$15=$A$4,Sheet3!N60,IF($A$15=$A$5,Sheet3!N100,IF($A$15=$A$6,Sheet3!N140,IF($A$15=$A$7,Sheet3!N180,IF($A$15=$A$8,Sheet3!N220,IF($A$15=$A$9,Sheet3!N260,\"XX\")))))))","v":"XX"},{"$f":"IF($A$15=$A$3,Sheet3!O21,IF($A$15=$A$4,Sheet3!O60,IF($A$15=$A$5,Sheet3!O100,IF($A$15=$A$6,Sheet3!O140,IF($A$15=$A$7,Sheet3!O180,IF($A$15=$A$8,Sheet3!O220,IF($A$15=$A$9,Sheet3!O260,\"XX\")))))))","v":"XX"}]
[null,null,{"$f":"B42","v":"XX"},{"$f":"IF($A$15=$A$3,Sheet3!B22,IF($A$15=$A$4,Sheet3!B61,IF($A$15=$A$5,Sheet3!B101,IF($A$15=$A$6,Sheet3!B141,IF($A$15=$A$7,Sheet3!B181,IF($A$15=$A$8,Sheet3!B221,IF($A$15=$A$9,Sheet3!B261,\"XX\")))))))","v":"XX"},{"$f":"IF($A$15=$A$3,Sheet3!C22,IF($A$15=$A$4,Sheet3!C61,IF($A$15=$A$5,Sheet3!C101,IF($A$15=$A$6,Sheet3!C141,IF($A$15=$A$7,Sheet3!C181,IF($A$15=$A$8,Sheet3!C221,IF($A$15=$A$9,Sheet3!C261,\"XX\")))))))","v":"XX"},{"$f":"IF($A$15=$A$3,Sheet3!D22,IF($A$15=$A$4,Sheet3!D61,IF($A$15=$A$5,Sheet3!D101,IF($A$15=$A$6,Sheet3!D141,IF($A$15=$A$7,Sheet3!D181,IF($A$15=$A$8,Sheet3!D221,IF($A$15=$A$9,Sheet3!D261,\"XX\")))))))","v":"XX"},{"$f":"IF($A$15=$A$3,Sheet3!E22,IF($A$15=$A$4,Sheet3!E61,IF($A$15=$A$5,Sheet3!E101,IF($A$15=$A$6,Sheet3!E141,IF($A$15=$A$7,Sheet3!E181,IF($A$15=$A$8,Sheet3!E221,IF($A$15=$A$9,Sheet3!E261,\"XX\")))))))","v":"XX"},{"$f":"IF($A$15=$A$3,Sheet3!F22,IF($A$15=$A$4,Sheet3!F61,IF($A$15=$A$5,Sheet3!F101,IF($A$15=$A$6,Sheet3!F141,IF($A$15=$A$7,Sheet3!F181,IF($A$15=$A$8,Sheet3!F221,IF($A$15=$A$9,Sheet3!F261,\"XX\")))))))","v":"XX"},{"$f":"IF($A$15=$A$3,Sheet3!G22,IF($A$15=$A$4,Sheet3!G61,IF($A$15=$A$5,Sheet3!G101,IF($A$15=$A$6,Sheet3!G141,IF($A$15=$A$7,Sheet3!G181,IF($A$15=$A$8,Sheet3!G221,IF($A$15=$A$9,Sheet3!G261,\"XX\")))))))","v":"XX"},{"$f":"IF($A$15=$A$3,Sheet3!H22,IF($A$15=$A$4,Sheet3!H61,IF($A$15=$A$5,Sheet3!H101,IF($A$15=$A$6,Sheet3!H141,IF($A$15=$A$7,Sheet3!H181,IF($A$15=$A$8,Sheet3!H221,IF($A$15=$A$9,Sheet3!H261,\"XX\")))))))","v":"XX"},{"$f":"IF($A$15=$A$3,Sheet3!I22,IF($A$15=$A$4,Sheet3!I61,IF($A$15=$A$5,Sheet3!I101,IF($A$15=$A$6,Sheet3!I141,IF($A$15=$A$7,Sheet3!I181,IF($A$15=$A$8,Sheet3!I221,IF($A$15=$A$9,Sheet3!I261,\"XX\")))))))","v":"XX"},{"$f":"IF($A$15=$A$3,Sheet3!J22,IF($A$15=$A$4,Sheet3!J61,IF($A$15=$A$5,Sheet3!J101,IF($A$15=$A$6,Sheet3!J141,IF($A$15=$A$7,Sheet3!J181,IF($A$15=$A$8,Sheet3!J221,IF($A$15=$A$9,Sheet3!J261,\"XX\")))))))","v":"XX"},{"$f":"IF($A$15=$A$3,Sheet3!K22,IF($A$15=$A$4,Sheet3!K61,IF($A$15=$A$5,Sheet3!K101,IF($A$15=$A$6,Sheet3!K141,IF($A$15=$A$7,Sheet3!K181,IF($A$15=$A$8,Sheet3!K221,IF($A$15=$A$9,Sheet3!K261,\"XX\")))))))","v":"XX"},{"$f":"IF($A$15=$A$3,Sheet3!L22,IF($A$15=$A$4,Sheet3!L61,IF($A$15=$A$5,Sheet3!L101,IF($A$15=$A$6,Sheet3!L141,IF($A$15=$A$7,Sheet3!L181,IF($A$15=$A$8,Sheet3!L221,IF($A$15=$A$9,Sheet3!L261,\"XX\")))))))","v":"XX"},{"$f":"IF($A$15=$A$3,Sheet3!M22,IF($A$15=$A$4,Sheet3!M61,IF($A$15=$A$5,Sheet3!M101,IF($A$15=$A$6,Sheet3!M141,IF($A$15=$A$7,Sheet3!M181,IF($A$15=$A$8,Sheet3!M221,IF($A$15=$A$9,Sheet3!M261,\"XX\")))))))","v":"XX"},{"$f":"IF($A$15=$A$3,Sheet3!N22,IF($A$15=$A$4,Sheet3!N61,IF($A$15=$A$5,Sheet3!N101,IF($A$15=$A$6,Sheet3!N141,IF($A$15=$A$7,Sheet3!N181,IF($A$15=$A$8,Sheet3!N221,IF($A$15=$A$9,Sheet3!N261,\"XX\")))))))","v":"XX"},{"$f":"IF($A$15=$A$3,Sheet3!O22,IF($A$15=$A$4,Sheet3!O61,IF($A$15=$A$5,Sheet3!O101,IF($A$15=$A$6,Sheet3!O141,IF($A$15=$A$7,Sheet3!O181,IF($A$15=$A$8,Sheet3!O221,IF($A$15=$A$9,Sheet3!O261,\"XX\")))))))","v":"XX"}]
[{"$f":"IF($A$15=$A$3,Sheet3!A24,IF($A$15=$A$4,Sheet3!A63,IF($A$15=$A$5,Sheet3!A103,IF($A$15=$A$6,Sheet3!A143,IF($A$15=$A$7,Sheet3!A183,IF($A$15=$A$8,Sheet3!A223,IF($A$15=$A$9,Sheet3!A263,\"XX\")))))))","v":"XX"},null,null,{"$f":"IF($A$15=$A$3,Sheet3!B23,IF($A$15=$A$4,Sheet3!B62,IF($A$15=$A$5,Sheet3!B102,IF($A$15=$A$6,Sheet3!B142,IF($A$15=$A$7,Sheet3!B182,IF($A$15=$A$8,Sheet3!B222,IF($A$15=$A$9,Sheet3!B262,\"XX\")))))))","v":"XX"},{"$f":"IF($A$15=$A$3,Sheet3!C23,IF($A$15=$A$4,Sheet3!C62,IF($A$15=$A$5,Sheet3!C102,IF($A$15=$A$6,Sheet3!C142,IF($A$15=$A$7,Sheet3!C182,IF($A$15=$A$8,Sheet3!C222,IF($A$15=$A$9,Sheet3!C262,\"XX\")))))))","v":"XX"},{"$f":"IF($A$15=$A$3,Sheet3!D23,IF($A$15=$A$4,Sheet3!D62,IF($A$15=$A$5,Sheet3!D102,IF($A$15=$A$6,Sheet3!D142,IF($A$15=$A$7,Sheet3!D182,IF($A$15=$A$8,Sheet3!D222,IF($A$15=$A$9,Sheet3!D262,\"XX\")))))))","v":"XX"},{"$f":"IF($A$15=$A$3,Sheet3!E23,IF($A$15=$A$4,Sheet3!E62,IF($A$15=$A$5,Sheet3!E102,IF($A$15=$A$6,Sheet3!E142,IF($A$15=$A$7,Sheet3!E182,IF($A$15=$A$8,Sheet3!E222,IF($A$15=$A$9,Sheet3!E262,\"XX\")))))))","v":"XX"},{"$f":"IF($A$15=$A$3,Sheet3!F23,IF($A$15=$A$4,Sheet3!F62,IF($A$15=$A$5,Sheet3!F102,IF($A$15=$A$6,Sheet3!F142,IF($A$15=$A$7,Sheet3!F182,IF($A$15=$A$8,Sheet3!F222,IF($A$15=$A$9,Sheet3!F262,\"XX\")))))))","v":"XX"},{"$f":"IF($A$15=$A$3,Sheet3!G23,IF($A$15=$A$4,Sheet3!G62,IF($A$15=$A$5,Sheet3!G102,IF($A$15=$A$6,Sheet3!G142,IF($A$15=$A$7,Sheet3!G182,IF($A$15=$A$8,Sheet3!G222,IF($A$15=$A$9,Sheet3!G262,\"XX\")))))))","v":"XX"},{"$f":"IF($A$15=$A$3,Sheet3!H23,IF($A$15=$A$4,Sheet3!H62,IF($A$15=$A$5,Sheet3!H102,IF($A$15=$A$6,Sheet3!H142,IF($A$15=$A$7,Sheet3!H182,IF($A$15=$A$8,Sheet3!H222,IF($A$15=$A$9,Sheet3!H262,\"XX\")))))))","v":"XX"},{"$f":"IF($A$15=$A$3,Sheet3!I23,IF($A$15=$A$4,Sheet3!I62,IF($A$15=$A$5,Sheet3!I102,IF($A$15=$A$6,Sheet3!I142,IF($A$15=$A$7,Sheet3!I182,IF($A$15=$A$8,Sheet3!I222,IF($A$15=$A$9,Sheet3!I262,\"XX\")))))))","v":"XX"},{"$f":"IF($A$15=$A$3,Sheet3!J23,IF($A$15=$A$4,Sheet3!J62,IF($A$15=$A$5,Sheet3!J102,IF($A$15=$A$6,Sheet3!J142,IF($A$15=$A$7,Sheet3!J182,IF($A$15=$A$8,Sheet3!J222,IF($A$15=$A$9,Sheet3!J262,\"XX\")))))))","v":"XX"},{"$f":"IF($A$15=$A$3,Sheet3!K23,IF($A$15=$A$4,Sheet3!K62,IF($A$15=$A$5,Sheet3!K102,IF($A$15=$A$6,Sheet3!K142,IF($A$15=$A$7,Sheet3!K182,IF($A$15=$A$8,Sheet3!K222,IF($A$15=$A$9,Sheet3!K262,\"XX\")))))))","v":"XX"},{"$f":"IF($A$15=$A$3,Sheet3!L23,IF($A$15=$A$4,Sheet3!L62,IF($A$15=$A$5,Sheet3!L102,IF($A$15=$A$6,Sheet3!L142,IF($A$15=$A$7,Sheet3!L182,IF($A$15=$A$8,Sheet3!L222,IF($A$15=$A$9,Sheet3!L262,\"XX\")))))))","v":"XX"},{"$f":"IF($A$15=$A$3,Sheet3!M23,IF($A$15=$A$4,Sheet3!M62,IF($A$15=$A$5,Sheet3!M102,IF($A$15=$A$6,Sheet3!M142,IF($A$15=$A$7,Sheet3!M182,IF($A$15=$A$8,Sheet3!M222,IF($A$15=$A$9,Sheet3!M262,\"XX\")))))))","v":"XX"},{"$f":"IF($A$15=$A$3,Sheet3!N23,IF($A$15=$A$4,Sheet3!N62,IF($A$15=$A$5,Sheet3!N102,IF($A$15=$A$6,Sheet3!N142,IF($A$15=$A$7,Sheet3!N182,IF($A$15=$A$8,Sheet3!N222,IF($A$15=$A$9,Sheet3!N262,\"XX\")))))))","v":"XX"},{"$f":"IF($A$15=$A$3,Sheet3!O23,IF($A$15=$A$4,Sheet3!O62,IF($A$15=$A$5,Sheet3!O102,IF($A$15=$A$6,Sheet3!O142,IF($A$15=$A$7,Sheet3!O182,IF($A$15=$A$8,Sheet3!O222,IF($A$15=$A$9,Sheet3!O262,\"XX\")))))))","v":"XX"}]
[null,{"$f":"A44","v":"XX"},null,{"$f":"IF($A$15=$A$3,Sheet3!B24,IF($A$15=$A$4,Sheet3!B63,IF($A$15=$A$5,Sheet3!B103,IF($A$15=$A$6,Sheet3!B143,IF($A$15=$A$7,Sheet3!B183,IF($A$15=$A$8,Sheet3!B223,IF($A$15=$A$9,Sheet3!B263,\"XX\")))))))","v":"XX"},{"$f":"IF($A$15=$A$3,Sheet3!C24,IF($A$15=$A$4,Sheet3!C63,IF($A$15=$A$5,Sheet3!C103,IF($A$15=$A$6,Sheet3!C143,IF($A$15=$A$7,Sheet3!C183,IF($A$15=$A$8,Sheet3!C223,IF($A$15=$A$9,Sheet3!C263,\"XX\")))))))","v":"XX"},{"$f":"IF($A$15=$A$3,Sheet3!D24,IF($A$15=$A$4,Sheet3!D63,IF($A$15=$A$5,Sheet3!D103,IF($A$15=$A$6,Sheet3!D143,IF($A$15=$A$7,Sheet3!D183,IF($A$15=$A$8,Sheet3!D223,IF($A$15=$A$9,Sheet3!D263,\"XX\")))))))","v":"XX"},{"$f":"IF($A$15=$A$3,Sheet3!E24,IF($A$15=$A$4,Sheet3!E63,IF($A$15=$A$5,Sheet3!E103,IF($A$15=$A$6,Sheet3!E143,IF($A$15=$A$7,Sheet3!E183,IF($A$15=$A$8,Sheet3!E223,IF($A$15=$A$9,Sheet3!E263,\"XX\")))))))","v":"XX"},{"$f":"IF($A$15=$A$3,Sheet3!F24,IF($A$15=$A$4,Sheet3!F63,IF($A$15=$A$5,Sheet3!F103,IF($A$15=$A$6,Sheet3!F143,IF($A$15=$A$7,Sheet3!F183,IF($A$15=$A$8,Sheet3!F223,IF($A$15=$A$9,Sheet3!F263,\"XX\")))))))","v":"XX"},{"$f":"IF($A$15=$A$3,Sheet3!G24,IF($A$15=$A$4,Sheet3!G63,IF($A$15=$A$5,Sheet3!G103,IF($A$15=$A$6,Sheet3!G143,IF($A$15=$A$7,Sheet3!G183,IF($A$15=$A$8,Sheet3!G223,IF($A$15=$A$9,Sheet3!G263,\"XX\")))))))","v":"XX"},{"$f":"IF($A$15=$A$3,Sheet3!H24,IF($A$15=$A$4,Sheet3!H63,IF($A$15=$A$5,Sheet3!H103,IF($A$15=$A$6,Sheet3!H143,IF($A$15=$A$7,Sheet3!H183,IF($A$15=$A$8,Sheet3!H223,IF($A$15=$A$9,Sheet3!H263,\"XX\")))))))","v":"XX"},{"$f":"IF($A$15=$A$3,Sheet3!I24,IF($A$15=$A$4,Sheet3!I63,IF($A$15=$A$5,Sheet3!I103,IF($A$15=$A$6,Sheet3!I143,IF($A$15=$A$7,Sheet3!I183,IF($A$15=$A$8,Sheet3!I223,IF($A$15=$A$9,Sheet3!I263,\"XX\")))))))","v":"XX"},{"$f":"IF($A$15=$A$3,Sheet3!J24,IF($A$15=$A$4,Sheet3!J63,IF($A$15=$A$5,Sheet3!J103,IF($A$15=$A$6,Sheet3!J143,IF($A$15=$A$7,Sheet3!J183,IF($A$15=$A$8,Sheet3!J223,IF($A$15=$A$9,Sheet3!J263,\"XX\")))))))","v":"XX"},{"$f":"IF($A$15=$A$3,Sheet3!K24,IF($A$15=$A$4,Sheet3!K63,IF($A$15=$A$5,Sheet3!K103,IF($A$15=$A$6,Sheet3!K143,IF($A$15=$A$7,Sheet3!K183,IF($A$15=$A$8,Sheet3!K223,IF($A$15=$A$9,Sheet3!K263,\"XX\")))))))","v":"XX"},{"$f":"IF($A$15=$A$3,Sheet3!L24,IF($A$15=$A$4,Sheet3!L63,IF($A$15=$A$5,Sheet3!L103,IF($A$15=$A$6,Sheet3!L143,IF($A$15=$A$7,Sheet3!L183,IF($A$15=$A$8,Sheet3!L223,IF($A$15=$A$9,Sheet3!L263,\"XX\")))))))","v":"XX"},{"$f":"IF($A$15=$A$3,Sheet3!M24,IF($A$15=$A$4,Sheet3!M63,IF($A$15=$A$5,Sheet3!M103,IF($A$15=$A$6,Sheet3!M143,IF($A$15=$A$7,Sheet3!M183,IF($A$15=$A$8,Sheet3!M223,IF($A$15=$A$9,Sheet3!M263,\"XX\")))))))","v":"XX"},{"$f":"IF($A$15=$A$3,Sheet3!N24,IF($A$15=$A$4,Sheet3!N63,IF($A$15=$A$5,Sheet3!N103,IF($A$15=$A$6,Sheet3!N143,IF($A$15=$A$7,Sheet3!N183,IF($A$15=$A$8,Sheet3!N223,IF($A$15=$A$9,Sheet3!N263,\"XX\")))))))","v":"XX"},{"$f":"IF($A$15=$A$3,Sheet3!O24,IF($A$15=$A$4,Sheet3!O63,IF($A$15=$A$5,Sheet3!O103,IF($A$15=$A$6,Sheet3!O143,IF($A$15=$A$7,Sheet3!O183,IF($A$15=$A$8,Sheet3!O223,IF($A$15=$A$9,Sheet3!O263,\"XX\")))))))","v":"XX"}]
[null,null,{"$f":"B45","v":"XX"},{"$f":"IF($A$15=$A$3,Sheet3!B25,IF($A$15=$A$4,Sheet3!B64,IF($A$15=$A$5,Sheet3!B104,IF($A$15=$A$6,Sheet3!B144,IF($A$15=$A$7,Sheet3!B184,IF($A$15=$A$8,Sheet3!B224,IF($A$15=$A$9,Sheet3!B264,\"XX\")))))))","v":"XX"},{"$f":"IF($A$15=$A$3,Sheet3!C25,IF($A$15=$A$4,Sheet3!C64,IF($A$15=$A$5,Sheet3!C104,IF($A$15=$A$6,Sheet3!C144,IF($A$15=$A$7,Sheet3!C184,IF($A$15=$A$8,Sheet3!C224,IF($A$15=$A$9,Sheet3!C264,\"XX\")))))))","v":"XX"},{"$f":"IF($A$15=$A$3,Sheet3!D25,IF($A$15=$A$4,Sheet3!D64,IF($A$15=$A$5,Sheet3!D104,IF($A$15=$A$6,Sheet3!D144,IF($A$15=$A$7,Sheet3!D184,IF($A$15=$A$8,Sheet3!D224,IF($A$15=$A$9,Sheet3!D264,\"XX\")))))))","v":"XX"},{"$f":"IF($A$15=$A$3,Sheet3!E25,IF($A$15=$A$4,Sheet3!E64,IF($A$15=$A$5,Sheet3!E104,IF($A$15=$A$6,Sheet3!E144,IF($A$15=$A$7,Sheet3!E184,IF($A$15=$A$8,Sheet3!E224,IF($A$15=$A$9,Sheet3!E264,\"XX\")))))))","v":"XX"},{"$f":"IF($A$15=$A$3,Sheet3!F25,IF($A$15=$A$4,Sheet3!F64,IF($A$15=$A$5,Sheet3!F104,IF($A$15=$A$6,Sheet3!F144,IF($A$15=$A$7,Sheet3!F184,IF($A$15=$A$8,Sheet3!F224,IF($A$15=$A$9,Sheet3!F264,\"XX\")))))))","v":"XX"},{"$f":"IF($A$15=$A$3,Sheet3!G25,IF($A$15=$A$4,Sheet3!G64,IF($A$15=$A$5,Sheet3!G104,IF($A$15=$A$6,Sheet3!G144,IF($A$15=$A$7,Sheet3!G184,IF($A$15=$A$8,Sheet3!G224,IF($A$15=$A$9,Sheet3!G264,\"XX\")))))))","v":"XX"},{"$f":"IF($A$15=$A$3,Sheet3!H25,IF($A$15=$A$4,Sheet3!H64,IF($A$15=$A$5,Sheet3!H104,IF($A$15=$A$6,Sheet3!H144,IF($A$15=$A$7,Sheet3!H184,IF($A$15=$A$8,Sheet3!H224,IF($A$15=$A$9,Sheet3!H264,\"XX\")))))))","v":"XX"},{"$f":"IF($A$15=$A$3,Sheet3!I25,IF($A$15=$A$4,Sheet3!I64,IF($A$15=$A$5,Sheet3!I104,IF($A$15=$A$6,Sheet3!I144,IF($A$15=$A$7,Sheet3!I184,IF($A$15=$A$8,Sheet3!I224,IF($A$15=$A$9,Sheet3!I264,\"XX\")))))))","v":"XX"},{"$f":"IF($A$15=$A$3,Sheet3!J25,IF($A$15=$A$4,Sheet3!J64,IF($A$15=$A$5,Sheet3!J104,IF($A$15=$A$6,Sheet3!J144,IF($A$15=$A$7,Sheet3!J184,IF($A$15=$A$8,Sheet3!J224,IF($A$15=$A$9,Sheet3!J264,\"XX\")))))))","v":"XX"},{"$f":"IF($A$15=$A$3,Sheet3!K25,IF($A$15=$A$4,Sheet3!K64,IF($A$15=$A$5,Sheet3!K104,IF($A$15=$A$6,Sheet3!K144,IF($A$15=$A$7,Sheet3!K184,IF($A$15=$A$8,Sheet3!K224,IF($A$15=$A$9,Sheet3!K264,\"XX\")))))))","v":"XX"},{"$f":"IF($A$15=$A$3,Sheet3!L25,IF($A$15=$A$4,Sheet3!L64,IF($A$15=$A$5,Sheet3!L104,IF($A$15=$A$6,Sheet3!L144,IF($A$15=$A$7,Sheet3!L184,IF($A$15=$A$8,Sheet3!L224,IF($A$15=$A$9,Sheet3!L264,\"XX\")))))))","v":"XX"},{"$f":"IF($A$15=$A$3,Sheet3!M25,IF($A$15=$A$4,Sheet3!M64,IF($A$15=$A$5,Sheet3!M104,IF($A$15=$A$6,Sheet3!M144,IF($A$15=$A$7,Sheet3!M184,IF($A$15=$A$8,Sheet3!M224,IF($A$15=$A$9,Sheet3!M264,\"XX\")))))))","v":"XX"},{"$f":"IF($A$15=$A$3,Sheet3!N25,IF($A$15=$A$4,Sheet3!N64,IF($A$15=$A$5,Sheet3!N104,IF($A$15=$A$6,Sheet3!N144,IF($A$15=$A$7,Sheet3!N184,IF($A$15=$A$8,Sheet3!N224,IF($A$15=$A$9,Sheet3!N264,\"XX\")))))))","v":"XX"},{"$f":"IF($A$15=$A$3,Sheet3!O25,IF($A$15=$A$4,Sheet3!O64,IF($A$15=$A$5,Sheet3!O104,IF($A$15=$A$6,Sheet3!O144,IF($A$15=$A$7,Sheet3!O184,IF($A$15=$A$8,Sheet3!O224,IF($A$15=$A$9,Sheet3!O264,\"XX\")))))))","v":"XX"}]
[{"$f":"IF($A$15=$A$3,Sheet3!A27,IF($A$15=$A$4,Sheet3!A66,IF($A$15=$A$5,Sheet3!A106,IF($A$15=$A$6,Sheet3!A146,IF($A$15=$A$7,Sheet3!A186,IF($A$15=$A$8,Sheet3!A226,IF($A$15=$A$9,Sheet3!A266,\"XX\")))))))","v":"XX"},null,null,{"$f":"IF($A$15=$A$3,Sheet3!B26,IF($A$15=$A$4,Sheet3!B65,IF($A$15=$A$5,Sheet3!B105,IF($A$15=$A$6,Sheet3!B145,IF($A$15=$A$7,Sheet3!B185,IF($A$15=$A$8,Sheet3!B225,IF($A$15=$A$9,Sheet3!B265,\"XX\")))))))","v":"XX"},{"$f":"IF($A$15=$A$3,Sheet3!C26,IF($A$15=$A$4,Sheet3!C65,IF($A$15=$A$5,Sheet3!C105,IF($A$15=$A$6,Sheet3!C145,IF($A$15=$A$7,Sheet3!C185,IF($A$15=$A$8,Sheet3!C225,IF($A$15=$A$9,Sheet3!C265,\"XX\")))))))","v":"XX"},{"$f":"IF($A$15=$A$3,Sheet3!D26,IF($A$15=$A$4,Sheet3!D65,IF($A$15=$A$5,Sheet3!D105,IF($A$15=$A$6,Sheet3!D145,IF($A$15=$A$7,Sheet3!D185,IF($A$15=$A$8,Sheet3!D225,IF($A$15=$A$9,Sheet3!D265,\"XX\")))))))","v":"XX"},{"$f":"IF($A$15=$A$3,Sheet3!E26,IF($A$15=$A$4,Sheet3!E65,IF($A$15=$A$5,Sheet3!E105,IF($A$15=$A$6,Sheet3!E145,IF($A$15=$A$7,Sheet3!E185,IF($A$15=$A$8,Sheet3!E225,IF($A$15=$A$9,Sheet3!E265,\"XX\")))))))","v":"XX"},{"$f":"IF($A$15=$A$3,Sheet3!F26,IF($A$15=$A$4,Sheet3!F65,IF($A$15=$A$5,Sheet3!F105,IF($A$15=$A$6,Sheet3!F145,IF($A$15=$A$7,Sheet3!F185,IF($A$15=$A$8,Sheet3!F225,IF($A$15=$A$9,Sheet3!F265,\"XX\")))))))","v":"XX"},{"$f":"IF($A$15=$A$3,Sheet3!G26,IF($A$15=$A$4,Sheet3!G65,IF($A$15=$A$5,Sheet3!G105,IF($A$15=$A$6,Sheet3!G145,IF($A$15=$A$7,Sheet3!G185,IF($A$15=$A$8,Sheet3!G225,IF($A$15=$A$9,Sheet3!G265,\"XX\")))))))","v":"XX"},{"$f":"IF($A$15=$A$3,Sheet3!H26,IF($A$15=$A$4,Sheet3!H65,IF($A$15=$A$5,Sheet3!H105,IF($A$15=$A$6,Sheet3!H145,IF($A$15=$A$7,Sheet3!H185,IF($A$15=$A$8,Sheet3!H225,IF($A$15=$A$9,Sheet3!H265,\"XX\")))))))","v":"XX"},{"$f":"IF($A$15=$A$3,Sheet3!I26,IF($A$15=$A$4,Sheet3!I65,IF($A$15=$A$5,Sheet3!I105,IF($A$15=$A$6,Sheet3!I145,IF($A$15=$A$7,Sheet3!I185,IF($A$15=$A$8,Sheet3!I225,IF($A$15=$A$9,Sheet3!I265,\"XX\")))))))","v":"XX"},{"$f":"IF($A$15=$A$3,Sheet3!J26,IF($A$15=$A$4,Sheet3!J65,IF($A$15=$A$5,Sheet3!J105,IF($A$15=$A$6,Sheet3!J145,IF($A$15=$A$7,Sheet3!J185,IF($A$15=$A$8,Sheet3!J225,IF($A$15=$A$9,Sheet3!J265,\"XX\")))))))","v":"XX"},{"$f":"IF($A$15=$A$3,Sheet3!K26,IF($A$15=$A$4,Sheet3!K65,IF($A$15=$A$5,Sheet3!K105,IF($A$15=$A$6,Sheet3!K145,IF($A$15=$A$7,Sheet3!K185,IF($A$15=$A$8,Sheet3!K225,IF($A$15=$A$9,Sheet3!K265,\"XX\")))))))","v":"XX"},{"$f":"IF($A$15=$A$3,Sheet3!L26,IF($A$15=$A$4,Sheet3!L65,IF($A$15=$A$5,Sheet3!L105,IF($A$15=$A$6,Sheet3!L145,IF($A$15=$A$7,Sheet3!L185,IF($A$15=$A$8,Sheet3!L225,IF($A$15=$A$9,Sheet3!L265,\"XX\")))))))","v":"XX"},{"$f":"IF($A$15=$A$3,Sheet3!M26,IF($A$15=$A$4,Sheet3!M65,IF($A$15=$A$5,Sheet3!M105,IF($A$15=$A$6,Sheet3!M145,IF($A$15=$A$7,Sheet3!M185,IF($A$15=$A$8,Sheet3!M225,IF($A$15=$A$9,Sheet3!M265,\"XX\")))))))","v":"XX"},{"$f":"IF($A$15=$A$3,Sheet3!N26,IF($A$15=$A$4,Sheet3!N65,IF($A$15=$A$5,Sheet3!N105,IF($A$15=$A$6,Sheet3!N145,IF($A$15=$A$7,Sheet3!N185,IF($A$15=$A$8,Sheet3!N225,IF($A$15=$A$9,Sheet3!N265,\"XX\")))))))","v":"XX"},{"$f":"IF($A$15=$A$3,Sheet3!O26,IF($A$15=$A$4,Sheet3!O65,IF($A$15=$A$5,Sheet3!O105,IF($A$15=$A$6,Sheet3!O145,IF($A$15=$A$7,Sheet3!O185,IF($A$15=$A$8,Sheet3!O225,IF($A$15=$A$9,Sheet3!O265,\"XX\")))))))","v":"XX"}]
[null,{"$f":"A47","v":"XX"},null,{"$f":"IF($A$15=$A$3,Sheet3!B27,IF($A$15=$A$4,Sheet3!B66,IF($A$15=$A$5,Sheet3!B106,IF($A$15=$A$6,Sheet3!B146,IF($A$15=$A$7,Sheet3!B186,IF($A$15=$A$8,Sheet3!B226,IF($A$15=$A$9,Sheet3!B266,\"XX\")))))))","v":"XX"},{"$f":"IF($A$15=$A$3,Sheet3!C27,IF($A$15=$A$4,Sheet3!C66,IF($A$15=$A$5,Sheet3!C106,IF($A$15=$A$6,Sheet3!C146,IF($A$15=$A$7,Sheet3!C186,IF($A$15=$A$8,Sheet3!C226,IF($A$15=$A$9,Sheet3!C266,\"XX\")))))))","v":"XX"},{"$f":"IF($A$15=$A$3,Sheet3!D27,IF($A$15=$A$4,Sheet3!D66,IF($A$15=$A$5,Sheet3!D106,IF($A$15=$A$6,Sheet3!D146,IF($A$15=$A$7,Sheet3!D186,IF($A$15=$A$8,Sheet3!D226,IF($A$15=$A$9,Sheet3!D266,\"XX\")))))))","v":"XX"},{"$f":"IF($A$15=$A$3,Sheet3!E27,IF($A$15=$A$4,Sheet3!E66,IF($A$15=$A$5,Sheet3!E106,IF($A$15=$A$6,Sheet3!E146,IF($A$15=$A$7,Sheet3!E186,IF($A$15=$A$8,Sheet3!E226,IF($A$15=$A$9,Sheet3!E266,\"XX\")))))))","v":"XX"},{"$f":"IF($A$15=$A$3,Sheet3!F27,IF($A$15=$A$4,Sheet3!F66,IF($A$15=$A$5,Sheet3!F106,IF($A$15=$A$6,Sheet3!F146,IF($A$15=$A$7,Sheet3!F186,IF($A$15=$A$8,Sheet3!F226,IF($A$15=$A$9,Sheet3!F266,\"XX\")))))))","v":"XX"},{"$f":"IF($A$15=$A$3,Sheet3!G27,IF($A$15=$A$4,Sheet3!G66,IF($A$15=$A$5,Sheet3!G106,IF($A$15=$A$6,Sheet3!G146,IF($A$15=$A$7,Sheet3!G186,IF($A$15=$A$8,Sheet3!G226,IF($A$15=$A$9,Sheet3!G266,\"XX\")))))))","v":"XX"},{"$f":"IF($A$15=$A$3,Sheet3!H27,IF($A$15=$A$4,Sheet3!H66,IF($A$15=$A$5,Sheet3!H106,IF($A$15=$A$6,Sheet3!H146,IF($A$15=$A$7,Sheet3!H186,IF($A$15=$A$8,Sheet3!H226,IF($A$15=$A$9,Sheet3!H266,\"XX\")))))))","v":"XX"},{"$f":"IF($A$15=$A$3,Sheet3!I27,IF($A$15=$A$4,Sheet3!I66,IF($A$15=$A$5,Sheet3!I106,IF($A$15=$A$6,Sheet3!I146,IF($A$15=$A$7,Sheet3!I186,IF($A$15=$A$8,Sheet3!I226,IF($A$15=$A$9,Sheet3!I266,\"XX\")))))))","v":"XX"},{"$f":"IF($A$15=$A$3,Sheet3!J27,IF($A$15=$A$4,Sheet3!J66,IF($A$15=$A$5,Sheet3!J106,IF($A$15=$A$6,Sheet3!J146,IF($A$15=$A$7,Sheet3!J186,IF($A$15=$A$8,Sheet3!J226,IF($A$15=$A$9,Sheet3!J266,\"XX\")))))))","v":"XX"},{"$f":"IF($A$15=$A$3,Sheet3!K27,IF($A$15=$A$4,Sheet3!K66,IF($A$15=$A$5,Sheet3!K106,IF($A$15=$A$6,Sheet3!K146,IF($A$15=$A$7,Sheet3!K186,IF($A$15=$A$8,Sheet3!K226,IF($A$15=$A$9,Sheet3!K266,\"XX\")))))))","v":"XX"},{"$f":"IF($A$15=$A$3,Sheet3!L27,IF($A$15=$A$4,Sheet3!L66,IF($A$15=$A$5,Sheet3!L106,IF($A$15=$A$6,Sheet3!L146,IF($A$15=$A$7,Sheet3!L186,IF($A$15=$A$8,Sheet3!L226,IF($A$15=$A$9,Sheet3!L266,\"XX\")))))))","v":"XX"},{"$f":"IF($A$15=$A$3,Sheet3!M27,IF($A$15=$A$4,Sheet3!M66,IF($A$15=$A$5,Sheet3!M106,IF($A$15=$A$6,Sheet3!M146,IF($A$15=$A$7,Sheet3!M186,IF($A$15=$A$8,Sheet3!M226,IF($A$15=$A$9,Sheet3!M266,\"XX\")))))))","v":"XX"},{"$f":"IF($A$15=$A$3,Sheet3!N27,IF($A$15=$A$4,Sheet3!N66,IF($A$15=$A$5,Sheet3!N106,IF($A$15=$A$6,Sheet3!N146,IF($A$15=$A$7,Sheet3!N186,IF($A$15=$A$8,Sheet3!N226,IF($A$15=$A$9,Sheet3!N266,\"XX\")))))))","v":"XX"},{"$f":"IF($A$15=$A$3,Sheet3!O27,IF($A$15=$A$4,Sheet3!O66,IF($A$15=$A$5,Sheet3!O106,IF($A$15=$A$6,Sheet3!O146,IF($A$15=$A$7,Sheet3!O186,IF($A$15=$A$8,Sheet3!O226,IF($A$15=$A$9,Sheet3!O266,\"XX\")))))))","v":"XX"}]
[null,null,{"$f":"A47","v":"XX"},{"$f":"IF($A$15=$A$3,Sheet3!B28,IF($A$15=$A$4,Sheet3!B67,IF($A$15=$A$5,Sheet3!B107,IF($A$15=$A$6,Sheet3!B147,IF($A$15=$A$7,Sheet3!B187,IF($A$15=$A$8,Sheet3!B227,IF($A$15=$A$9,Sheet3!B267,\"XX\")))))))","v":"XX"},{"$f":"IF($A$15=$A$3,Sheet3!C28,IF($A$15=$A$4,Sheet3!C67,IF($A$15=$A$5,Sheet3!C107,IF($A$15=$A$6,Sheet3!C147,IF($A$15=$A$7,Sheet3!C187,IF($A$15=$A$8,Sheet3!C227,IF($A$15=$A$9,Sheet3!C267,\"XX\")))))))","v":"XX"},{"$f":"IF($A$15=$A$3,Sheet3!D28,IF($A$15=$A$4,Sheet3!D67,IF($A$15=$A$5,Sheet3!D107,IF($A$15=$A$6,Sheet3!D147,IF($A$15=$A$7,Sheet3!D187,IF($A$15=$A$8,Sheet3!D227,IF($A$15=$A$9,Sheet3!D267,\"XX\")))))))","v":"XX"},{"$f":"IF($A$15=$A$3,Sheet3!E28,IF($A$15=$A$4,Sheet3!E67,IF($A$15=$A$5,Sheet3!E107,IF($A$15=$A$6,Sheet3!E147,IF($A$15=$A$7,Sheet3!E187,IF($A$15=$A$8,Sheet3!E227,IF($A$15=$A$9,Sheet3!E267,\"XX\")))))))","v":"XX"},{"$f":"IF($A$15=$A$3,Sheet3!F28,IF($A$15=$A$4,Sheet3!F67,IF($A$15=$A$5,Sheet3!F107,IF($A$15=$A$6,Sheet3!F147,IF($A$15=$A$7,Sheet3!F187,IF($A$15=$A$8,Sheet3!F227,IF($A$15=$A$9,Sheet3!F267,\"XX\")))))))","v":"XX"},{"$f":"IF($A$15=$A$3,Sheet3!G28,IF($A$15=$A$4,Sheet3!G67,IF($A$15=$A$5,Sheet3!G107,IF($A$15=$A$6,Sheet3!G147,IF($A$15=$A$7,Sheet3!G187,IF($A$15=$A$8,Sheet3!G227,IF($A$15=$A$9,Sheet3!G267,\"XX\")))))))","v":"XX"},{"$f":"IF($A$15=$A$3,Sheet3!H28,IF($A$15=$A$4,Sheet3!H67,IF($A$15=$A$5,Sheet3!H107,IF($A$15=$A$6,Sheet3!H147,IF($A$15=$A$7,Sheet3!H187,IF($A$15=$A$8,Sheet3!H227,IF($A$15=$A$9,Sheet3!H267,\"XX\")))))))","v":"XX"},{"$f":"IF($A$15=$A$3,Sheet3!I28,IF($A$15=$A$4,Sheet3!I67,IF($A$15=$A$5,Sheet3!I107,IF($A$15=$A$6,Sheet3!I147,IF($A$15=$A$7,Sheet3!I187,IF($A$15=$A$8,Sheet3!I227,IF($A$15=$A$9,Sheet3!I267,\"XX\")))))))","v":"XX"},{"$f":"IF($A$15=$A$3,Sheet3!J28,IF($A$15=$A$4,Sheet3!J67,IF($A$15=$A$5,Sheet3!J107,IF($A$15=$A$6,Sheet3!J147,IF($A$15=$A$7,Sheet3!J187,IF($A$15=$A$8,Sheet3!J227,IF($A$15=$A$9,Sheet3!J267,\"XX\")))))))","v":"XX"},{"$f":"IF($A$15=$A$3,Sheet3!K28,IF($A$15=$A$4,Sheet3!K67,IF($A$15=$A$5,Sheet3!K107,IF($A$15=$A$6,Sheet3!K147,IF($A$15=$A$7,Sheet3!K187,IF($A$15=$A$8,Sheet3!K227,IF($A$15=$A$9,Sheet3!K267,\"XX\")))))))","v":"XX"},{"$f":"IF($A$15=$A$3,Sheet3!L28,IF($A$15=$A$4,Sheet3!L67,IF($A$15=$A$5,Sheet3!L107,IF($A$15=$A$6,Sheet3!L147,IF($A$15=$A$7,Sheet3!L187,IF($A$15=$A$8,Sheet3!L227,IF($A$15=$A$9,Sheet3!L267,\"XX\")))))))","v":"XX"},{"$f":"IF($A$15=$A$3,Sheet3!M28,IF($A$15=$A$4,Sheet3!M67,IF($A$15=$A$5,Sheet3!M107,IF($A$15=$A$6,Sheet3!M147,IF($A$15=$A$7,Sheet3!M187,IF($A$15=$A$8,Sheet3!M227,IF($A$15=$A$9,Sheet3!M267,\"XX\")))))))","v":"XX"},{"$f":"IF($A$15=$A$3,Sheet3!N28,IF($A$15=$A$4,Sheet3!N67,IF($A$15=$A$5,Sheet3!N107,IF($A$15=$A$6,Sheet3!N147,IF($A$15=$A$7,Sheet3!N187,IF($A$15=$A$8,Sheet3!N227,IF($A$15=$A$9,Sheet3!N267,\"XX\")))))))","v":"XX"},{"$f":"IF($A$15=$A$3,Sheet3!O28,IF($A$15=$A$4,Sheet3!O67,IF($A$15=$A$5,Sheet3!O107,IF($A$15=$A$6,Sheet3!O147,IF($A$15=$A$7,Sheet3!O187,IF($A$15=$A$8,Sheet3!O227,IF($A$15=$A$9,Sheet3!O267,\"XX\")))))))","v":"XX"}]
[]
[]
[]
[]
["Material Rating Factor",null,{"$f":"IF(M15=0,0,IF(M15=\"BL3\",0.6,1))","v":0},null,"Force Zeros for BL00",null,{"$f":"IF(M15=0,0,IF(M15=\"BL00\",0,1))","v":0},null,"Combined Factor",null,{"$f":"G54*C54","v":0}]
[]
[null,null,null,{"$f":"F24","v":"XX"},{"$f":"H24","v":"XX"},{"$f":"J24","v":"XX"},{"$f":"L24","v":"XX"},{"$f":"N24","v":"XX"},{"$f":"P24","v":"XX"}]
["Continuous Output Torque - Nm",null,null,{"$f":"VLOOKUP($D$15,$A$25:$Q$49,6,FALSE)*K54","v":{"$error":"#N/A"}},{"$f":"VLOOKUP($D$15,$A$25:$Q$49,8,FALSE)*K54","v":{"$error":"#N/A"}},{"$f":"VLOOKUP($D$15,$A$25:$Q$49,10,FALSE)*K54","v":{"$error":"#N/A"}},{"$f":"VLOOKUP($D$15,$A$25:$Q$49,12,FALSE)*K54","v":{"$error":"#N/A"}},{"$f":"VLOOKUP($D$15,$A$25:$Q$49,14,FALSE)*K54","v":{"$error":"#N/A"}},{"$f":"VLOOKUP($D$15,$A$25:$Q$49,16,FALSE)*K54","v":{"$error":"#N/A"}}]
["Intermittant Output Torque - Nm",null,null,{"$f":"VLOOKUP($D$15,$B$25:$Q$49,5,FALSE)*K54","v":{"$error":"#N/A"}},{"$f":"VLOOKUP($D$15,$B$25:$Q$49,7,FALSE)*K54","v":{"$error":"#N/A"}},{"$f":"VLOOKUP($D$15,$B$25:$Q$49,9,FALSE)*K54","v":{"$error":"#N/A"}},{"$f":"VLOOKUP($D$15,$B$25:$Q$49,11,FALSE)*K54","v":{"$error":"#N/A"}},{"$f":"VLOOKUP($D$15,$B$25:$Q$49,13,FALSE)*K54","v":{"$error":"#N/A"}},{"$f":"VLOOKUP($D$15,$B$25:$Q$49,15,FALSE)*K54","v":{"$error":"#N/A"}}]
["Efficiency",null,null,{"$f":"VLOOKUP($D$15,$C$25:$Q$49,4,FALSE)*G54","v":{"$error":"#N/A"}},{"$f":"VLOOKUP($D$15,$C$25:$Q$49,6,FALSE)*G54","v":{"$error":"#N/A"}},{"$f":"VLOOKUP($D$15,$C$25:$Q$49,8,FALSE)*G54","v":{"$error":"#N/A"}},{"$f":"VLOOKUP($D$15,$C$25:$Q$49,10,FALSE)*G54","v":{"$error":"#N/A"}},{"$f":"VLOOKUP($D$15,$C$25:$Q$49,12,FALSE)*G54","v":{"$error":"#N/A"}},{"$f":"VLOOKUP($D$15,$C$25:$Q$49,14,FALSE)*G54","v":{"$error":"#N/A"}}]

{"sheet":"Sheet3","index":2,"n_rows":264,"n_cols":18,"rows_kept":264,"cut":false,"hidden":true,"merged":[[1,8,1,9],[2,3,2,4],[2,5,2,6],[2,7,2,8],[2,9,2,10],[2,11,2,12],[2,13,2,14],[2,16,2,17],[3,1,3,2],[6,3,6,4],[6,5,6,6],[6,7,6,8],[6,9,6,10],[6,11,6,12],[6,13,6,14],[15,13,15,14],[12,3,12,4],[12,5,12,6],[12,7,12,8],[12,9,12,10],[12,11,12,12],[12,13,12,14],[9,3,9,4],[9,5,9,6],[9,7,9,8],[9,9,9,10],[9,11,9,12],[9,13,9,14],[40,8,40,9],[41,3,41,4],[41,5,41,6],[41,7,41,8],[41,9,41,10],[41,11,41,12],[15,3,15,4],[15,5,15,6],[15,7,15,8],[15,9,15,10],[15,11,15,12],[48,3,48,4],[48,5,48,6],[48,7,48,8],[48,9,48,10],[48,11,48,12],[48,13,48,14],[41,13,41,14],[41,16,41,17],[42,1,42,2],[45,3,45,4],[45,5,45,6],[45,7,45,8],[45,9,45,10],[45,11,45,12],[45,13,45,14],[57,13,57,14],[54,3,54,4],[54,5,54,6],[54,7,54,8],[54,9,54,10],[54,11,54,12],[54,13,54,14],[51,3,51,4],[51,5,51,6],[51,7,51,8],[51,9,51,10],[51,11,51,12],[51,13,51,14],[80,8,80,9],[81,3,81,4],[81,5,81,6],[81,7,81,8],[81,9,81,10],[81,11,81,12],[57,3,57,4],[57,5,57,6],[57,7,57,8],[57,9,57,10],[57,11,57,12],[60,3,60,4],[60,5,60,6],[60,7,60,8],[60,9,60,10],[60,11,60,12],[81,13,81,14],[81,16,81,17],[82,1,82,2],[85,3,85,4],[85,5,85,6],[85,7,85,8],[85,9,85,10],[85,11,85,12],[85,13,85,14],[91,3,91,4],[91,5,91,6],[91,7,91,8],[91,9,91,10],[91,11,91,12],[91,13,91,14],[88,3,88,4],[88,5,88,6],[88,7,88,8],[88,9,88,10],[88,11,88,12],[88,13,88,14],[97,3,97,4],[97,5,97,6],[97,7,97,8],[97,9,97,10],[97,11,97,12],[97,13,97,14],[94,3,94,4],[94,5,94,6],[94,7,94,8],[94,9,94,10],[94,11,94,12],[94,13,94,14],[106,13,106,14],[103,3,103,4],[103,5,103,6],[103,7,103,8],[103,9,103,10],[103,11,103,12],[103,13,103,14],[100,3,100,4],[100,5,100,6],[100,7,100,8],[100,9,100,10],[100,11,100,12],[100,13,100,14],[120,8,120,9],[121,3,121,4],[121,5,121,6],[121,7,121,8],[121,9,121,10],[121,11,121,12],[106,3,106,4],[106,5,106,6],[106,7,106,8],[106,9,106,10],[106,11,106,12],[121,13,121,14],[121,16,121,17],[122,1,122,2],[125,3,125,4],[125,5,125,6],[125,7,125,8],[125,9,125,10],[125,11,125,12],[125,13,125,14],[131,3,131,4],[131,5,131,6],[131,7,131,8],[131,9,131,10],[131,11,131,12],[131,13,131,14],[128,3,128,4],[128,5,128,6],[128,7,128,8],[128,9,128,10],[128,11,128,12],[128,13,128,14],[140,13,140,14],[137,3,137,4],[137,5,137,6],[137,7,137,8],[137,9,137,10],[137,11,137,12],[137,13,137,14],[134,3,134,4],[134,5,134,6],[134,7,134,8],[134,9,134,10],[134,11,134,12],[134,13,134,14],[160,8,160,9],[161,3,161,4],[161,5,161,6],[161,7,161,8],[161,9,161,10],[161,11,161,12],[140,3,140,4],[140,5,140,6],[140,7,140,8],[140,9,140,10],[140,11,140,12],[161,13,161,14],[161,16,161,17],[162,1,162,2],[165,3,165,4],[165,5,165,6],[165,7,165,8],[165,9,165,10],[165,11,165,12],[165,13,165,14],[171,3,171,4],[171,5,171,6],[171,7,171,8],[171,9,171,10],[171,11,171,12],[171,13,171,14],[168,3,168,4],[168,5,168,6],[168,7,168,8],[168,9,168,10],[168,11,168,12],[168,13,168,14],[177,3,177,4],[177,5,177,6],[177,7,177,8],[177,9,177,10],[177,11,177,12],[177,13,177,14],[174,3,174,4],[174,5,174,6],[174,7,174,8],[174,9,174,10],[174,11,174,12],[174,13,174,14],[186,13,186,14],[183,3,183,4],[183,5,183,6],[183,7,183,8],[183,9,183,10],[183,11,183,12],[183,13,183,14],[180,3,180,4],[180,5,180,6],[180,7,180,8],[180,9,180,10],[180,11,180,12],[180,13,180,14],[200,8,200,9],[201,3,201,4],[201,5,201,6],[201,7,201,8],[201,9,201,10],[201,11,201,12],[186,3,186,4],[186,5,186,6],[186,7,186,8],[186,9,186,10],[186,11,186,12],[208,3,208,4],[208,5,208,6],[208,7,208,8],[208,9,208,10],[208,11,208,12],[208,13,208,14],[201,13,201,14],[201,16,201,17],[202,1,202,2],[205,3,205,4],[205,5,205,6],[205,7,205,8],[205,9,205,10],[205,11,205,12],[205,13,205,14],[214,3,214,4],[214,5,214,6],[214,7,214,8],[214,9,214,10],[214,11,214,12],[214,13,214,14],[211,3,211,4],[211,5,211,6],[211,7,211,8],[211,9,211,10],[211,11,211,12],[211,13,211,14],[223,13,223,14],[220,3,220,4],[220,5,220,6],[220,7,220,8],[220,9,220,10],[220,11,220,12],[220,13,220,14],[217,3,217,4],[217,5,217,6],[217,7,217,8],[217,9,217,10],[217,11,217,12],[217,13,217,14],[240,8,240,9],[241,3,241,4],[241,5,241,6],[241,7,241,8],[241,9,241,10],[241,11,241,12],[223,3,223,4],[223,5,223,6],[223,7,223,8],[223,9,223,10],[223,11,223,12],[241,13,241,14],[241,16,241,17],[242,1,242,2],[245,3,245,4],[245,5,245,6],[245,7,245,8],[245,9,245,10],[245,11,245,12],[245,13,245,14],[254,13,254,14],[251,3,251,4],[251,5,251,6],[251,7,251,8],[251,9,251,10],[251,11,251,12],[251,13,251,14],[248,3,248,4],[248,5,248,6],[248,7,248,8],[248,9,248,10],[248,11,248,12],[248,13,248,14],[60,13,60,14],[263,3,263,4],[263,5,263,6],[263,7,263,8],[263,9,263,10],[263,11,263,12],[263,13,263,14],[260,3,260,4],[260,5,260,6],[260,7,260,8],[260,9,260,10],[260,11,260,12],[260,13,260,14],[257,3,257,4],[257,5,257,6],[257,7,257,8],[257,9,257,10],[257,11,257,12],[257,13,257,14],[254,3,254,4],[254,5,254,6],[254,7,254,8],[254,9,254,10],[254,11,254,12]]}
["Spiradriveâ 12mm"]
[null,null,null,null,null,null,null,null,"Input speed rpm"]
["Ratio",null,null,1,null,250,null,500,null,1000,null,1500,null,3000,null,null,"Separating factors"]
[null,"Gearbox & Gearset Characteristics (steel)",null,"N.m.","lb.f.ins","N.m.","lb.f.ins","N.m.","lb.f.ins","N.m.","lb.f.ins","N.m.","lb.f.ins","N.m.","lb.f.ins","Force","LoSide","HiSide"]
[null,"Output","Continuous",8.1199999999999992,71.84,6.36,56.29,3.64,32.22,2.0699999999999998,18.29,1.42,12.56,0.79,7.01,"Fx",1.702,1.5049999999999999]
[10.199999999999999,"Torque","Intermittent",8.1199999999999992,71.84,6.65,58.82,6.07,53.7,5.37,47.5,4.8899999999999997,43.32,4.0599999999999996,39.950000000000003,"Fy",0.51500000000000001,0.88400000000000001]
[null,"Efficiency","(Approx.) %",0.75,null,0.8,null,0.82,null,0.83,null,0.85,null,0.88,null,"Fz",0.76600000000000001,1.19]
[null,"Output","Continuous",11.41,101.02,8.81,78.010000000000005,5.0199999999999996,44.46,2.83,25.08,1.94,17.16,1.07,9.51,"Fx",1.891,1.6890000000000001]
[16.329999999999998,"Torque","Intermittent",11.41,101.02,9.2100000000000009,81.510000000000005,8.3699999999999992,74.099999999999994,7.36,65.14,6.69,59.17,5.51,47.79,"Fy",0.37,0.92100000000000004]
[null,"Efficiency","(Approx.) %",0.63,null,0.7,null,0.72,null,0.74,null,0.77,null,0.8,null,"Fz",0.50800000000000001,1.0900000000000001]
[null,"Output","Continuous",11.21,99.2,8.58,75.95,4.88,43.19,2.74,24.26,1.87,16.57,1.03,9.15,"Fx",2.0099999999999998,1.79]
[25.5,"Torque","Intermittent",11.21,99.2,8.9700000000000006,79.36,8.1300000000000008,71.98,7.12,63.02,6.46,57.14,5.3,46.92,"Fy",0.377,0.99199999999999999]
[null,"Efficiency","(Approx.) %",0.5,null,0.57999999999999996,null,0.6,null,0.63,null,0.67,null,0.71,null,"Fz",0.43099999999999999,1.095]
[null,"Output","Continuous",11.17,98.9,8.44,74.709999999999994,4.78,42.32,2.67,23.6,1.82,16.079999999999998,1,8.82,"Fx",2.0859999999999999,1.8580000000000001]
[36,"Torque","Intermittent",11.17,98.9,8.82,78.069999999999993,7.97,70.540000000000006,6.93,61.3,6.27,55.46,5.1100000000000003,45.23,"Fy",0.38200000000000001,1.0389999999999999]
[null,"Efficiency","(Approx.) %",0.39,null,0.47,null,0.49,null,0.53,null,0.56000000000000005,null,0.61,null,"Fz",0.40200000000000002,1.1100000000000001]
[]
[]
[]
[]
[]
[]
[]
[]
[]
[]
[]
[]
[]
[]
[]
[]
[]
[]
[]
[]
[]
[]
[]
["Spiradriveâ 16mm"]
[null,null,null,null,null,null,null,null,"Input speed rpm"]
["Ratio",null,null,1,null,250,null,500,null,1000,null,1500,null,3000,null,null,"Separating factors"]
[null,"Gearbox & Gearset Characteristics (steel)",null,"N.m.","lb.f.ins","N.m.","lb.f.ins","N.m.","lb.f.ins","N.m.","lb.f.ins","N.m.","lb.f.ins","N.m.","lb.f.ins","Force","LoSide","HiSide"]
[null,"Output","Continuous",18.55,null,14,123.9,7.9139999999999997,70.02,4.4000000000000004,38.96,3,26.52,1.64,14.45,"Fx",1.2829999999999999,1.137]
[10.199999999999999,"Torque","Intermittent",18.55,164.2,14.63,129.5,13.19,116.7,11.43,101.2,10.33,91.45,8.4,74.33,"Fy",0.38800000000000001,0.74099999999999999]
[null,"Efficiency","(Approx.) %",0.74,null,0.81,null,0.82,null,0.85,null,0.86,null,0.89,null,"Fz",0.57099999999999995,0.94599999999999995]
[null,"Output","Continuous",26.56,null,19.93,176.5,11.26,99.6,6.24,55.28,4.25,37.61,2.3199999999999998,20.48,"Fx",1.399,1.2609999999999999]
[16.329999999999998,"Torque","Intermittent",26.56,235.1,20.83,184.4,18.760000000000002,166,16.22,143.6,14.65,129.69999999999999,11.89,105.2,"Fy",0.27600000000000002,0.68799999999999994]
[null,"Efficiency","(Approx.) %",0.64,null,0.72,null,0.73,null,0.77,null,0.79,null,0.82,null,"Fz",0.39300000000000002,0.81699999999999995]
[null,"Output","Continuous",26.85,null,19.71,174.5,11.24,97.86,6.07,53.75,4.1100000000000003,36.4,2.2200000000000002,19.66,"Fx",1.512,1.359]
[25.5,"Torque","Intermittent",26.85,237.6,20.6,182.3,18.73,163.1,15.77,139.6,14.18,125.5,11.39,100.8,"Fy",0.28299999999999997,0.755]
[null,"Efficiency","(Approx.) %",0.49,null,0.57999999999999996,null,0.6,null,0.65,null,0.67,null,0.73,null,"Fz",0.32200000000000001,0.82399999999999995]
[null,"Output","Continuous",25.84,null,19.03,168.4,10.69,94.62,5.88,52.05,3.98,35.26,2.16,19.079999999999998,"Fx",1.548,1.3879999999999999]
[36,"Torque","Intermittent",25.84,288.7,19.89,176,17.82,157.69999999999999,15.28,135.19999999999999,13.74,121.6,11.06,97.87,"Fy",0.28499999999999998,0.77600000000000002]
[null,"Efficiency","(Approx.) %",0.41,null,0.5,null,0.52,null,0.56999999999999995,null,0.6,null,0.65,null,"Fz",0.30099999999999999,0.83]
[null,"Output","Continuous",26.4,null,19.09,169,10.66,94.4,5.83,51.55,3.93,34.770000000000003,2.11,18.649999999999999,"Fx",1.6060000000000001,1.4410000000000001]
[60,"Torque","Intermittent",26.4,233.7,19.95,176.6,17.77,157.33000000000001,15.13,133.9,13.55,119.9,10.8,95.62,"Fy",0.28899999999999998,0.81200000000000006]
[null,"Efficiency","(Approx.) %",0.26,null,0.35,null,0.36,null,0.42,null,0.44,null,0.51,null,"Fz",0.29199999999999998,0.84599999999999997]
[null,"Output","Continuous",24.322855075392066,215.24650509196519,17.516045881387814,155.00925558750276,9.7711496619689751,86.470350990875886,5.2747122197632548,46.678869201444734,3.4823293354880418,30.817073765380901,1.8501385637310395,16.372907643637518,"Fx",1.3480000000000001,1.327]
[90,"Torque","Intermittent",24.322855075392066,215.24650509196519,18.306256049313497,162.00226592312828,16.28471196045048,144.11249522522547,13.702504889582938,121.26110521754812,12.007918517129928,106.26476563831794,9.4786877368938995,83.882192361892919,"Fy",0.24399999999999999,0.79700000000000004]
[null,"Efficiency","(Approx.) ",0.22600000000000001,null,0.31,null,0.34,null,0.376,null,0.4,null,0.44700000000000001,null,"Fz",0.28699999999999998,0.3]
[]
[]
[]
[]
[]
[]
[]
[]
[]
[]
[]
[]
[]
[]
[]
[]
[]
[]
["Spiradriveâ 19mm"]
[null,null,null,null,null,null,null,null,"Input speed rpm"]
["Ratio",null,null,1,null,250,null,500,null,1000,null,1500,null,3000,null,null,"Separating factors"]
[null,"Gearbox & Gearset Characteristics (steel)",null,"N.m.","lb.f.ins","N.m.","lb.f.ins","N.m.","lb.f.ins","N.m.","lb.f.ins","N.m.","lb.f.ins","N.m.","lb.f.ins","Force","LoSide","HiSide"]
[null,"Output","Continuous",27.9,247,16.8,149,11.6,103,6.4,56.6,4.5,39.799999999999997,2.1,18.7,"Fx",0.93400000000000005,0.93600000000000005]
[8.17,"Torque","Intermittent",27.9,247,22.3,197,19.3,171,16.600000000000001,147,15,133,12.1,107,"Fy",0.45200000000000001,0.76300000000000001]
[null,"Efficiency","(Approx.) %",0.79,null,0.84,null,0.86,null,0.88,null,0.89,null,0.92,null,"Fz",0.47199999999999998,0.42399999999999999]
[null,"Output","Continuous",34.200000000000003,303,20.7,183,14.3,127,7.8,69.3,5.5,48.4,2.6,22.9,"Fx",1.0449999999999999,1.054]
[10.25,"Torque","Intermittent",34.200000000000003,303,27.3,242,23.7,210,20.3,180,18.3,162,14.8,131,"Fy",0.372,0.76500000000000001]
[null,"Efficiency","(Approx.) %",0.75,null,0.81,null,0.83,null,0.86,null,0.87,null,0.9,null,"Fz",0.38600000000000001,0.25800000000000001]
[null,"Output","Continuous",34.200000000000003,303,20.7,183,14.1,125,7.8,69,5.4,48,2.6,22.6,"Fx",1.0780000000000001,1.0860000000000001]
[12.33,"Torque","Intermittent",34.200000000000003,303,27.2,241,23.6,209,20.2,179,18.2,161,14.6,129,"Fy",0.35399999999999998,0.747]
[null,"Efficiency","(Approx.) %",0.7,null,0.77,null,0.79,null,0.81,null,0.84,null,0.85,null,"Fz",0.34100000000000003,0.218]
[null,"Output","Continuous",45.3,401,26.2,232,18.100000000000001,160,9.8000000000000007,87,6.8,60.1,3.1,27.8,"Fx",1.179,1.179]
[25.5,"Torque","Intermittent",45.3,401,35,310,29.9,265,25.4,225,22.7,201,18,159,"Fy",0.222,0.71899999999999997]
[null,"Efficiency","(Approx.) %",0.48,null,0.56999999999999995,null,0.6,null,0.66,null,0.68,null,0.74,null,"Fz",0.20499999999999999,0.122]
[null,"Output","Continuous",40.700000000000003,360,25.5,226,16.3,144,8.8000000000000007,78.14,6.1,54.1,2.8,25.2,"Fx",1.202,1.1970000000000001]
[36,"Torque","Intermittent",40.700000000000003,360,31.5,279,27,239,22.9,203,20.5,181,16.3,144,"Fy",0.22,0.78300000000000003]
[null,"Efficiency","(Approx.) %",0.4,null,0.48,null,0.52,null,0.57999999999999996,null,0.6,null,0.67,null,"Fz",0.17199999999999999,0.13100000000000001]
[null,"Output","Continuous",44.6,395,27.6,244,17.5,155,9.4,83.2,6.5,57.4,3,26.4,"Fx",1.1519999999999999,1.1240000000000001]
[60,"Torque","Intermittent",44.6,395,34,301,28.9,256,24.4,216,21.7,192,17.100000000000001,151,"Fy",0.183,0.55600000000000005]
[null,"Efficiency","(Approx.) %",0.26,null,0.34,null,0.37,null,0.43,null,0.45,null,0.53,null,"Fz",0.153,0.36]
[null,"Output","Continuous",45.1,399,29,257,18,159,9.6999999999999993,85.9,6.8,60.2,3.1,27.4,"Fx",1.2350000000000001,1.23]
[90,"Torque","Intermittent",45.1,399,35,310,30,266,25.4,22.5,22.6,200,17.8,158,"Fy",0.11,0.64700000000000002]
[null,"Efficiency","(Approx.) %",0.27,null,0.28999999999999998,null,0.31,null,0.36,null,0.39,null,0.45,null,"Fz",0.122,0.108]
[null,"Output","Continuous",46,407,27.3,242,18.5,164,10,88.5,7,61.6,3.2,28.5,"Fx",1.236,1.2290000000000001]
[108,"Torque","Intermittent",46,407,35.700000000000003,316,30.6,271,26,230,23.3,206,18.399999999999999,163,"Fy",0.219,0.64400000000000002]
[null,"Efficiency","(Approx.) %",0.18,null,0.23,null,0.26,null,0.31,null,0.33,null,0.4,null,"Fz",0.113,0.108]
[]
[]
[]
[]
[]
[]
[]
[]
[]
[]
[]
[]
["Spiradriveâ 25mm"]
[null,null,null,null,null,null,null,null,"Input speed rpm"]
["Ratio",null,null,1,null,250,null,500,null,1000,null,1500,null,3000,null,null,"Separating factors"]
[null,"Gearbox & Gearset Characteristics (steel)",null,"N.m.","lb.f.ins","N.m.","lb.f.ins","N.m.","lb.f.ins","N.m.","lb.f.ins","N.m.","lb.f.ins","N.m.","lb.f.ins","Force","LoSide","HiSide"]
[null,"Output","Continuous",108.56,606.79999999999995,49.2,435.4,27.27,241.4,14.85,131.4,9.9700000000000006,88.25,5.32,47.05,"Fx",0.81,0.73699999999999999]
[10.25,"Torque","Intermittent",108.56,606.79999999999995,51.41,455,45.45,402.3,38.56,341.3,34.380000000000003,304.3,27.26,241.3,"Fy",0.248,0.47799999999999998]
[null,"Efficiency","(Approx.) %",0.76,null,0.83,0,0.84,0,0.87,0,0.88,0,0.91,0,"Fz",0.39200000000000002,0.622]
[null,"Output","Continuous",92.9,822.2,65.25,577.6,35.9,317.8,19.84,175.6,12.97,114.8,6.86,60.68,"Fx",0.89400000000000002,0.81]
[16.329999999999998,"Torque","Intermittent",92.9,822.2,68.180000000000007,603.4,59.84,529.6,51.52,456,44.72,395.8,35.159999999999997,311.2,"Fy",0.17599999999999999,0.49099999999999999]
[null,"Efficiency","(Approx.) %",0.63,null,0.72,null,0.75,null,0.78,null,0.8,null,0.85,null,"Fz",0.252,0.56399999999999995]
[null,"Output","Continuous",97.81,865.7,67.83,600.29999999999995,37.130000000000003,328.7,19.989999999999998,176.9,13.33,117.9,7.01,62.05,"Fx",0.95599999999999996,0.86899999999999999]
[25.5,"Torque","Intermittent",97.81,865.7,70.88,627.29999999999995,61.89,547.79999999999995,51.92,459.5,45.95,406.7,35.950000000000003,318.2,"Fy",0.18,0.48299999999999998]
[null,"Efficiency","(Approx.) %",0.5,null,0.6,null,0.64,null,0.68,null,0.71,null,0.78,null,"Fz",0.21,0.52700000000000002]
[null,"Output","Continuous",93.71,829.4,65.22,577.29999999999995,35.799999999999997,316.8,19.29,170.7,12.87,113.9,6.79,60.06,"Fx",0.98199999999999998,0.88900000000000001]
[36,"Torque","Intermittent",93.71,829.4,68.150000000000006,603.20000000000005,59.66,528,50.1,443.4,44.39,392.9,34.799999999999997,308,"Fy",0.18099999999999999,0.497]
[null,"Efficiency","(Approx.) %",0.42,null,0.52,null,0.56000000000000005,null,0.61,null,0.63,null,0.71,null,"Fz",0.19700000000000001,0.53]
[null,"Output","Continuous",102.3,905.1,69.930000000000007,618.9,38.06,336.9,20.41,180.6,13.56,120,7.1,62.82,"Fx",1.02,0.92900000000000005]
[58,"Torque","Intermittent",102.3,905.1,73.069999999999993,646.70000000000005,63.44,561.5,53.01,469.2,46.76,413.9,36.4,322.13,"Fy",0.184,0.47199999999999998]
[null,"Efficiency","(Approx.) %",0.28000000000000003,null,0.37,null,0.41,null,0.46,null,0.49,null,0.57999999999999996,null,"Fz",0.187,0.49199999999999999]
[null,"Output","Continuous",77.73,688,63.74,564.20000000000005,35.909999999999997,317.8,19.32,170.9,12.73,112.7,6.35,56.24,"Fx",0.98499999999999999,0.92700000000000005]
[100,"Torque","Intermittent",77.73,688,66.599999999999994,589.5,59.85,529.70000000000005,50.17,444,43.89,388.5,32.58,288.39999999999998,"Fy",0.182,0.48199999999999998]
[null,"Efficiency","(Approx.) %",0.18,null,0.25,null,0.28999999999999998,null,0.32,null,0.36,null,0.44,null,"Fz",0.192,0.49099999999999999]
[]
[]
[]
[]
[]
[]
[]
[]
[]
[]
[]
[]
[]
[]
[]
[]
[]
[]
["Spiradriveâ  Performance 38mm"]
[null,null,null,null,null,null,null,null,"Input speed rpm"]
["Ratio",null,null,1,null,250,null,500,null,1000,null,1500,null,3000,null,null,"Separating factors"]
[null,"Gearbox & Gearset Characteristics (steel)",null,"N.m.","lb.f.ins","N.m.","lb.f.ins","N.m.","lb.f.ins","N.m.","lb.f.ins","N.m.","lb.f.ins","N.m.","lb.f.ins","Force","LoSide","HiSide"]
[null,"Output","Continuous",240,2128,149,1319,91.2,807,48.5,430,33.299999999999997,295,15.3,135,"Fx",0.54400000000000004,0.5]
[10.199999999999999,"Torque","Intermittent",240,2128,180,1591,151,1334,126.1,116,111,985,86.2,769,"Fy",0.221,0.39]
[null,"Efficiency","(Approx.) %",0.78,null,0.86,null,0.88,null,0.89,null,0.91,null,0.93,null,"Fz",0.18,0.185]
[null,"Output","Continuous",331,2926,194,1717,122,1077,64.3,569,43.8,388,19.899999999999999,176,"Fx",0.59799999999999998,0.56000000000000005]
[17.329999999999998,"Torque","Intermittent",331,2926,242,2143,201,1780,167,1478,147,1299,114,1006,"Fy",0.13700000000000001,0.34699999999999998]
[null,"Efficiency","(Approx.) %",0.65,null,0.75,null,0.78,null,0.81,null,0.84,null,0.88,null,"Fz",0.11600000000000001,0.113]
[null,"Output","Continuous",330,2924,190,1682,119.3,1056,62.8,556,42.8,379,19.3,171,"Fx",0.61,0.57099999999999995]
[25.5,"Torque","Intermittent",330,2924,239,2115,197.3,1746,163,1445,143,1266,110,976,"Fy",0.13,0.34399999999999997]
[null,"Efficiency","(Approx.) %",0.54,null,0.66,null,0.7,null,0.73,null,0.76,null,0.83,null,"Fz",9.9000000000000005E-2,0.105]
[null,"Output","Continuous",288,2551,169,1496,106,940,56.2,497,38.299999999999997,339,17.399999999999999,154,"Fx",0.62,0.57699999999999996]
[31,"Torque","Intermittent",288,2551,211,1868,175,1553,146,1291,128,1135,99.3,879,"Fy",0.13200000000000001,0.379]
[null,"Efficiency","(Approx.) %",0.51,null,0.63,null,0.67,null,0.71,null,0.74,null,0.8,null,"Fz",8.7999999999999995E-2,0.10100000000000001]
[null,"Output","Continuous",336,2972,192,1699,118,1045,61.8,547,41.9,371,18.8,166,"Fx",0.628,0.58799999999999997]
[36.5,"Torque","Intermittent",336,2972,239,2112,195,1728,161,1421,140,1240,107.3,950,"Fy",0.124,0.34300000000000003]
[null,"Efficiency","(Approx.) %",0.42,null,0.54,null,0.59,null,0.64,null,0.68,null,0.75,null,"Fz",7.2999999999999995E-2,9.2999999999999999E-2]
[null,"Output","Continuous",326,2886,185,1637,114,1012,59.8,529,40.4,358,18.2,161,"Fx",0.64400000000000002,0.54900000000000004]
[58,"Torque","Intermittent",326,2886,231,2046,189,1673,155,1375,135,1199,104,918,"Fy",0.123,0.26]
[null,"Efficiency","(Approx.) %",0.31,null,0.43,null,0.48,null,0.52,null,0.56999999999999995,null,0.66,null,"Fz",5.3999999999999999E-2,0.19400000000000001]
[null,"Output","Continuous",305,2699,179,1584,105,930,54.7,484,36.9,327,16.5,146,"Fx",0.65400000000000003,0.61499999999999999]
[90,"Torque","Intermittent",305,2699,214,1891,174,1537,142,1257,123.5,1093,94.2,834,"Fy",0.121,0.31900000000000001]
[null,"Efficiency","(Approx.) %",0.22,null,0.31,null,0.36,null,0.4,null,0.45,null,0.54,null,"Fz",4.2000000000000003E-2,6.6000000000000003E-2]
[null,"Output","Continuous",380,3363,204,1806,132,1171,68.8,609,46.3,410,20.7,183,"Fx",0.67100000000000004,0.60399999999999998]
[120,"Torque","Intermittent",380,3363,270,2388,219,1936,179,1581,155,1373,118,1046,"Fy",0.121,0.251]
[null,"Efficiency","(Approx.) %",0.17,null,0.25,null,0.28999999999999998,null,0.33,null,0.37,null,0.46,null,"Fz",0.02,0.13200000000000001]
[]
[]
[]
[]
[]
[]
[]
[]
[]
[]
[]
[]
["Spiradriveâ  50mm"]
[null,null,null,null,null,null,null,null,"Input speed rpm"]
["Ratio",null,null,1,null,250,null,500,null,1000,null,1500,null,3000,null,null,"Separating factors"]
[null,"Gearbox & Gearset Characteristics (steel)",null,"N.m.","lb.f.ins","N.m.","lb.f.ins","N.m.","lb.f.ins","N.m.","lb.f.ins","N.m.","lb.f.ins","N.m.","lb.f.ins","Force","LoSide","HiSide"]
[null,"Output","Continuous",559,5047,315,2791,194,1721,102,904,69,614,31,274,"Fx",0.374,0.34399999999999997]
[10.199999999999999,"Torque","Intermittent",559,5047,380,3363,324,2868,265,2349,231,2047,177,1567,"Fy",0.11700000000000001,0.222]
[null,"Efficiency","(Approx.) %",0.76,null,0.84,null,0.87,null,0.89,null,0.91,null,0.93,null,"Fz",0.20200000000000001,0.29899999999999999]
[null,"Output","Continuous",792,7009,421,3724,247,2366,139,1235,95,835,42,371,"Fx",0.42599999999999999,0.39900000000000002]
[17.329999999999998,"Torque","Intermittent",792,7009,526,4655,412,3943,362,3208,315,2784,239,2119,"Fy",8.5999999999999993E-2,0.218]
[null,"Efficiency","(Approx.) %",0.19,null,0.74,null,0.78,null,0.82,null,0.84,null,0.88,null,"Fz",0.13500000000000001,0.25700000000000001]
[null,"Output","Continuous",788,6978,413,3650,261,2310,121,1201,92,810,40,358,"Fx",0.45300000000000001,0.42399999999999999]
[25.5,"Torque","Intermittent",788,6978,516,4563,435,3850,352,3119,305,2699,231,2047,"Fy",8.7999999999999995E-2,0.23499999999999999]
[null,"Efficiency","(Approx.) %",0.51,null,0.64,null,0.69,null,0.73,null,0.77,null,0.83,null,"Fz",0.114,0.25800000000000001]
[null,"Output","Continuous",755,6687,396,3506,251,2219,131,1154,88,779,39,345,"Fx",0.46800000000000003,0.438]
[38,"Torque","Intermittent",755,6687,495,4382,418,3698,339,2998,293,2596,222,1970,"Fy",8.7999999999999995E-2,0.246]
[null,"Efficiency","(Approx.) %",0.41,null,0.54,null,0.59,null,0.65,null,0.69,null,0.76,null,"Fz",0.10299999999999999,0.26100000000000001]
[null,"Output","Continuous",829,7340,424,3753,267,2362,138,1219,93,819,41,361,"Fx",0.48499999999999999,0.45600000000000002]
[58,"Torque","Intermittent",829,7340,530,4691,445,3937,358,3167,309,2731,233,2062,"Fy",0.09,0.23200000000000001]
[null,"Efficiency","(Approx.) %",0.28999999999999998,null,0.42,null,0.47,null,0.53,null,0.57999999999999996,null,0.65,null,"Fz",9.6000000000000002E-2,0.24199999999999999]
[null,"Output","Continuous",787,6933,392,3473,246,2177,126,1117,85,748,37,329,"Fx",0.496,0.46400000000000002]
[90,"Torque","Intermittent",787,6933,490,4341,410,3629,328,2902,282,2494,212,1878,"Fy",0.09,0.26300000000000001]
[null,"Efficiency","(Approx.) %",0.19,null,0.3,null,0.34,null,0.4,null,0.45,null,0.51,null,"Fz",9.2999999999999999E-2,0.27]
[null,"Output","Continuous",1154,10212,545,4824,359,3179,184,1628,123,1089,54,478,"Fx",0.5,0.46800000000000003]
[120,"Torque","Intermittent",1154,10212,717,6347,599,5298,478,4229,410,3630,308,2730,"Fy",9.0999999999999998E-2,0.26600000000000001]
[null,"Efficiency","(Approx.) %",0.15,null,0.24,null,0.27,null,0.33,null,0.38,null,0.43,null,"Fz",9.2999999999999999E-2,0.27200000000000002]
[]
[]
[]
[]
[]
[]
[]
[]
[]
[]
[]
[]
[]
[]
[]
["Spiradriveâ 70mm"]
[null,null,null,null,null,null,null,null,"Input speed rpm"]
["Ratio",null,null,1,null,250,null,500,null,1000,null,1500,null,3000,null,null,"Separating factors"]
[null,"Gearbox & Gearset Characteristics (steel)",null,"N.m.","lb.f.ins","N.m.","lb.f.ins","N.m.","lb.f.ins","N.m.","lb.f.ins","N.m.","lb.f.ins","N.m.","lb.f.ins","Force","LoSide","HiSide"]
[null,"Output","Continuous",1458,12909,781,6916,475,4206,246,2174,165,1463,73,645,"Fx",0.26700000000000002,0.247]
[10.199999999999999,"Torque","Intermittent",1458,12909,941,8333,792,7010,638,5647,551,4877,416,3686,"Fy",8.4000000000000005E-2,0.14299999999999999]
[null,"Efficiency","(Approx.) %",0.77,null,0.86,null,0.88,null,0.91,null,0.93,null,0.94,null,"Fz",0.152,0.20699999999999999]
[null,"Output","Continuous",1633,14454,816,7219,511,4522,262,2317,175,1551,77,679,"Fx",0.311,0.28899999999999998]
[17.329999999999998,"Torque","Intermittent",1633,14454,1020,9024,851,7536,680,6017,584,5169,438,3881,"Fy",9.0999999999999998E-2,0.158]
[null,"Efficiency","(Approx.) %",0.64,null,0.77,null,0.8,null,0.84,null,0.87,null,0.9,null,"Fz",0.11700000000000001,0.186]
[null,"Output","Continuous",2015,17837,993,8714,620,5486,316,2800,211,1870,92,817,"Fx",0.32800000000000001,0.307]
[25.5,"Torque","Intermittent",2015,17837,1241,10983,1033,9143,822,7273,704,6235,528,4670,"Fy",6.3E-2,0.17]
[null,"Efficiency","(Approx.) %",0.52,null,0.68,null,0.71,null,0.77,null,0.81,null,0.84,null,"Fz",8.3000000000000004E-2,0.188]
[null,"Output","Continuous",2049,18138,986,8725,610,5402,309,2737,206,1822,90,792,"Fx",0.34300000000000003,0.32200000000000001]
[36.5,"Torque","Intermittent",2049,18138,1232,10906,1017,9003,803,7110,686,6075,512,4528,"Fy",6.4000000000000001E-2,0.18]
[null,"Efficiency","(Approx.) %",0.4,null,0.56000000000000005,null,0.61,null,0.68,null,0.73,null,0.77,null,"Fz",7.3999999999999996E-2,0.191]
[null,"Output","Continuous",2124,18802,1021,9038,632,5600,321,2838,214,1889,93,822,"Fx",0.35299999999999998,0.33200000000000002]
[58,"Torque","Intermittent",2124,18802,1276,11298,1054,9333,833,7372,712,6298,531,4696,"Fy",6.5000000000000002E-2,0.16900000000000001]
[null,"Efficiency","(Approx.) %",0.3,null,0.45,null,0.5,null,0.56999999999999995,null,0.63,null,0.68,null,"Fz",7.0000000000000007E-2,0.17599999999999999]
[null,"Output","Continuous",2149,19018,1059,9374,625,5530,315,2788,209,1852,91,803,"Fx",0.36,0.33900000000000002]
[87,"Torque","Intermittent",2149,19018,1265,11193,1041,9217,818,7242,697,6172,518,4586,"Fy",6.6000000000000003E-2,0.17299999999999999]
[null,"Efficiency","(Approx.) %",0.21,null,0.34,null,0.38,null,0.46,null,0.52,null,0.56999999999999995,null,"Fz",6.8000000000000005E-2,0.17799999999999999]
[null,"Output","Continuous",2541,22487,1120,9914,731,6468,368,3254,244,2158,106,934,"Fx",0.36399999999999999,0.34399999999999997]
[120,"Torque","Intermittent",2541,22487,1483,13123,1218,10780,955,8451,813,7195,603,5337,"Fy",6.6000000000000003E-2,0.158]
[null,"Efficiency","(Approx.) %",0.16,null,0.27,null,0.31,null,0.38,null,0.44,null,0.49,null,"Fz",6.7000000000000004E-2,0.16200000000000001]